{"text_format":"1","workbook":"xlsx","n_sheets":5,"sheets":["Spring_Home","X_Spring","SpringCalculation","Date","Matrix"],"not_rendered":{"charts":0,"images":8,"macros":1,"external_links":0,"defined_names":38,"comments":1,"pivot_tables":0},"unopened":[],"bounds":{"document_bytes":16777216,"sheet_cells":100000,"rows_first":2000,"rows_last":500,"rows_between":2000,"halvings":0,"cell_chars":16384,"cell_head_chars":4096},"cells_cut":0,"cells_raw":0,"read":"whole","date_system":"1900"}

{"sheet":"Spring_Home","index":0,"n_rows":39,"n_cols":11,"rows_kept":39,"cut":false,"hidden":false,"merged":[[1,0,1,8]]}
[]
["Spring selection HOME"]
[]
[]
[null,null,"DW",2500,"[mm]",{"$f":"IF(Date!$B$7>Date!B7,Date!B9,\"\")","v":""}]
[null,null,"DH",2125,"[mm]",{"$f":"IF(Date!$B$7>365,Date!B10,\"\")","v":""}]
[null,null,"KG",75,"[kg]",{"$f":"IF(Date!$B$7>365,Date!B11,\"\")","v":""}]
[]
[]
[null,null,"Spring Home-X extension spring"]
[]
[null,null,null,"Art.nb:","Description"]
[null,null,null,{"$f":"IF(AND(KG<=130,DH<3001,DW<5501),VeerX,NOSP)","v":115527},{"$f":"X_Spring!T1","v":"HOME-X Spring SET L=735, 2125_2250 (-- / 3,4 / 3,8)"}]
[]
[]
[]
[]
[null,null,"Home-F & R torsion spring",null,null,null,null,null,null,null,{"$f":"\"Build-in information \"&SpringCalculation!SC_RESULT_QTY&\" Springs.\"","v":"Build-in information 2 Springs."}]
[]
[null,null,"Lifetime",15000]
[]
[null,null,null,"Art.nb:","Qty set","Turns","Lifetime"]
[null,null,null,{"$f":"SC_RESULT_ITEM","v":3295305512},{"$f":"SpringCalculation!SC_RESULT_QTY/2","v":1},{"$f":"SpringCalculation!SC_RESULT_RST","v":7.3},{"$f":"SpringCalculation!SC_RESULT_ELT","v":18333}]
[]
[null,null,null,"Other solutions"]
[null,1,null,{"$f":"IF($B26>SC_RESULT_MAX,\"\",SpringCalculation!T3)","v":3295004482},{"$f":"IF($B26>SC_RESULT_MAX,\"\",SpringCalculation!U3/2)","v":1},{"$f":"IF($B26>SC_RESULT_MAX,\"\",SpringCalculation!V3)","v":7.4136768222859635},{"$f":"IF($B26>SC_RESULT_MAX,\"\",SpringCalculation!W3)","v":10833}]
[null,{"$f":"B26+1","v":2},null,{"$f":"IF($B27>SC_RESULT_MAX,\"\",SpringCalculation!T4)","v":3295305512},{"$f":"IF($B27>SC_RESULT_MAX,\"\",SpringCalculation!U4/2)","v":1},{"$f":"IF($B27>SC_RESULT_MAX,\"\",SpringCalculation!V4)","v":7.3318609396221985},{"$f":"IF($B27>SC_RESULT_MAX,\"\",SpringCalculation!W4)","v":18333}]
[null,{"$f":"B27+1","v":3},null,{"$f":"IF($B28>SC_RESULT_MAX,\"\",SpringCalculation!T5)","v":3295306002},{"$f":"IF($B28>SC_RESULT_MAX,\"\",SpringCalculation!U5/2)","v":1},{"$f":"IF($B28>SC_RESULT_MAX,\"\",SpringCalculation!V5)","v":7.4529015909382741},{"$f":"IF($B28>SC_RESULT_MAX,\"\",SpringCalculation!W5)","v":26667}]
[null,4,null,{"$f":"IF($B29>SC_RESULT_MAX,\"\",SpringCalculation!T6)","v":3295506982},{"$f":"IF($B29>SC_RESULT_MAX,\"\",SpringCalculation!U6/2)","v":1},{"$f":"IF($B29>SC_RESULT_MAX,\"\",SpringCalculation!V6)","v":7.4244471262800475},{"$f":"IF($B29>SC_RESULT_MAX,\"\",SpringCalculation!W6)","v":41500}]
[null,5,null,{"$f":"IF($B30>SC_RESULT_MAX,\"\",SpringCalculation!T7)","v":3396008112},{"$f":"IF($B30>SC_RESULT_MAX,\"\",SpringCalculation!U7/2)","v":1},{"$f":"IF($B30>SC_RESULT_MAX,\"\",SpringCalculation!V7)","v":7.4017222560025173},{"$f":"IF($B30>SC_RESULT_MAX,\"\",SpringCalculation!W7)","v":93750}]
[null,6,null,{"$f":"IF($B31>SC_RESULT_MAX,\"\",SpringCalculation!T8)","v":""},{"$f":"IF($B31>SC_RESULT_MAX,\"\",SpringCalculation!U8/2)","v":""},{"$f":"IF($B31>SC_RESULT_MAX,\"\",SpringCalculation!V8)","v":""},{"$f":"IF($B31>SC_RESULT_MAX,\"\",SpringCalculation!W8)","v":""}]
[null,7,null,{"$f":"IF($B32>SC_RESULT_MAX,\"\",SpringCalculation!T9)","v":""},{"$f":"IF($B32>SC_RESULT_MAX,\"\",SpringCalculation!U9/2)","v":""},{"$f":"IF($B32>SC_RESULT_MAX,\"\",SpringCalculation!V9)","v":""},{"$f":"IF($B32>SC_RESULT_MAX,\"\",SpringCalculation!W9)","v":""}]
[null,8,null,{"$f":"IF($B33>SC_RESULT_MAX,\"\",SpringCalculation!T10)","v":""},{"$f":"IF($B33>SC_RESULT_MAX,\"\",SpringCalculation!U10/2)","v":""},{"$f":"IF($B33>SC_RESULT_MAX,\"\",SpringCalculation!V10)","v":""},{"$f":"IF($B33>SC_RESULT_MAX,\"\",SpringCalculation!W10)","v":""}]
[null,9,null,{"$f":"IF($B34>SC_RESULT_MAX,\"\",SpringCalculation!T11)","v":""},{"$f":"IF($B34>SC_RESULT_MAX,\"\",SpringCalculation!U11/2)","v":""},{"$f":"IF($B34>SC_RESULT_MAX,\"\",SpringCalculation!V11)","v":""},{"$f":"IF($B34>SC_RESULT_MAX,\"\",SpringCalculation!W11)","v":""}]
[null,10,null,{"$f":"IF($B35>SC_RESULT_MAX,\"\",SpringCalculation!T12)","v":""},{"$f":"IF($B35>SC_RESULT_MAX,\"\",SpringCalculation!U12/2)","v":""},{"$f":"IF($B35>SC_RESULT_MAX,\"\",SpringCalculation!V12)","v":""},{"$f":"IF($B35>SC_RESULT_MAX,\"\",SpringCalculation!W12)","v":""}]
[null,11,null,{"$f":"IF($B36>SC_RESULT_MAX,\"\",SpringCalculation!T13)","v":""},{"$f":"IF($B36>SC_RESULT_MAX,\"\",SpringCalculation!U13/2)","v":""},{"$f":"IF($B36>SC_RESULT_MAX,\"\",SpringCalculation!V13)","v":""},{"$f":"IF($B36>SC_RESULT_MAX,\"\",SpringCalculation!W13)","v":""}]
[null,12,null,{"$f":"IF($B37>SC_RESULT_MAX,\"\",SpringCalculation!T14)","v":""},{"$f":"IF($B37>SC_RESULT_MAX,\"\",SpringCalculation!U14/2)","v":""},{"$f":"IF($B37>SC_RESULT_MAX,\"\",SpringCalculation!V14)","v":""},{"$f":"IF($B37>SC_RESULT_MAX,\"\",SpringCalculation!W14)","v":""}]
[null,null,null,"Calculated with drum diameter M102"]
[null,null,null,null,null,null,null,null,{"$f":"\"V1.0 Date: \"&TEXT(Date!B4,\"dd-mmm-jjjj\")","v":"V1.0 Date: 01-mrt-2021"}]

{"sheet":"X_Spring","index":1,"n_rows":55,"n_cols":20,"rows_kept":55,"cut":false,"hidden":true,"merged":[]}
["ITEM","F0 [N]","RS [N/mm]","DH,min","DH,max","SELECT,H","KG@DH","RESULT_ID",null,"Input:",null,null,"Vaste gegevens:",null,null,null,null,null,null,{"$f":"_xlfn.IFNA(VLOOKUP(VeerX,S2:T55,2,0),\"-\")","v":"HOME-X Spring SET L=735, 2125_2250 (-- / 3,4 / 3,8)"}]
[115501,38,0.37436507451144224,1751,2000,{"$f":"IF(AND((DH-IF(VOETJE=TRUE,8,0))>=D2,(DH-IF(VOETJE=TRUE,8,0))<=E2),1,0)","v":0},{"$f":"(((C2*VEERWEG)+B2)*CORRECTION_FACTOR)/9.81","v":43.213621162825959},{"$f":"IF(AND(F2=1,G2<=KG_MAX),MAX($H1:H1)+1,0)","v":0},null,"DH",{"$f":"DH","v":2125},null,"CORRECTION",1.08,null,null,null,null,115501,"HOME-X Spring SET L=650, 1875_2000 (2,1 / 3,0 / --)"]
[115502,42,0.43678056600096238,1751,2000,0,50.161232587476484,{"$f":"IF(AND(F3=1,G3<=KG_MAX),MAX($H2:H2)+1,0)","v":0},null,"KG",{"$f":"KG","v":75},null,"KG MAX↑",0.05,null,null,null,null,115502,"HOME-X Spring SET L=650, 1875_2000 (2,3 / 3,0 / --)"]
[115503,45,0.47048149750353424,1751,{"$f":"2000","v":2000},0,54.005061813120768,{"$f":"IF(AND(F4=1,G4<=KG_MAX),MAX($H3:H3)+1,0)","v":0},null,"VOETJE",false,null,null,null,null,null,null,null,115503,"HOME-X Spring SET L=650, 1875_2000 (2,1 / 3,2 / --)"]
[115504,49,0.53289698899305438,1751,2000,0,60.952673237771293,{"$f":"IF(AND(F5=1,G5<=KG_MAX),MAX($H4:H4)+1,0)","v":0},null,"VEERWEG",{"$f":"(DH-231)/2","v":947},null,"KG_MAX",{"$f":"KG*(1+KG_MAX_FACTOR)","v":78.75},null,null,null,null,115504,"HOME-X Spring SET L=650, 1875_2000 (2,3 / 3,2 / --)"]
[115505,52,0.59806474373261964,1751,{"$f":"2000","v":2000},0,68.077135300710907,{"$f":"IF(AND(F6=1,G6<=KG_MAX),MAX($H5:H5)+1,0)","v":0},null,null,null,null,null,null,null,null,null,null,115505,"HOME-X Spring SET L=650, 1875_2000 (2,1 / 3,4 / --)"]
[115506,56,0.66048023522213983,1751,2000,0,75.024746725361439,{"$f":"IF(AND(F7=1,G7<=KG_MAX),MAX($H6:H6)+1,0)","v":0},null,null,null,null,null,null,null,null,null,null,115506,"HOME-X Spring SET L=650, 1875_2000 (2,3 / 3,4 / --)"]
[115507,69,0.75112253469365575,1751,{"$f":"2000","v":2000},0,85.906022791364251,{"$f":"IF(AND(F8=1,G8<=KG_MAX),MAX($H7:H7)+1,0)","v":0},null,"Resultaat:",null,null,null,null,null,null,null,null,115507,"HOME-X Spring SET L=650, 1875_2000 (-- / 3,4 / 3,8)"]
[115508,76,0.84395488275165553,1751,2000,0,96.355076032934079,{"$f":"IF(AND(F9=1,G9<=KG_MAX),MAX($H8:H8)+1,0)","v":0},null,"RESULT_ID",{"$f":"MAX(H2:H54)","v":7},null,null,null,null,null,null,null,115508,"HOME-X Spring SET L=650, 1875_2000 (-- / 3,4 / 4,0)"]
[115509,85,0.98942373576900033,1751,{"$f":"2000","v":2000},0,112.51203058054055,{"$f":"IF(AND(F10=1,G10<=KG_MAX),MAX($H9:H9)+1,0)","v":0},null,"SPRING",{"$f":"IF(KG>130,\"NO SPRING!\",IF(RESULT_ID>0,INDEX(A2:A54,MATCH(RESULT_ID,H2:H54,0)),\"NO SPRING!\"))","v":115527},null,null,null,null,null,null,null,115509,"HOME-X Spring SET L=650, 1875_2000 (-- / 3,4 / 4,3)"]
[115510,99,1.1290404318098006,1751,2000,0,128.60931621180345,{"$f":"IF(AND(F11=1,G11<=KG_MAX),MAX($H10:H10)+1,0)","v":0},null,null,null,null,null,null,null,null,null,null,115510,"HOME-X Spring SET L=650, 1875_2000 (2,1 / 3,4 / 4,3)"]
[115511,110,1.3219052912040483,1751,{"$f":"2000","v":2000},0,149.92781402975049,{"$f":"IF(AND(F12=1,G12<=KG_MAX),MAX($H11:H11)+1,0)","v":0},null,null,null,null,null,null,null,null,null,null,115511,"HOME-X Spring SET L=650, 1875_2000 (2,1 / 3,4 / 4,5)"]
[115521,36,0.32076735213339408,2001,2250,1,37.405506327008169,{"$f":"IF(AND(F13=1,G13<=KG_MAX),MAX($H12:H12)+1,0)","v":1},null,"opmerkingen",null,null,null,null,null,null,null,null,115521,"HOME-X Spring SET L=735, 2125_2250 (2,3 / 2,8 / --)"]
[115522,41,0.36262232639019903,2001,2250,1,42.319634101818551,{"$f":"IF(AND(F14=1,G14<=KG_MAX),MAX($H13:H13)+1,0)","v":2},null,{"$f":"B1","v":"F0 [N]"},"Vaste waarde. Eigenschappen van samengestelde veer",null,null,null,null,null,null,null,115522,"HOME-X Spring SET L=735, 2125_2250 (1,9 / 3,2 / --)"]
[115523,45,0.41356240782291931,2001,2250,1,48.070855068804171,{"$f":"IF(AND(F15=1,G15<=KG_MAX),MAX($H14:H14)+1,0)","v":3},null,{"$f":"C1","v":"RS [N/mm]"},"Vaste waarde. Eigenschappen van samengestelde veer",null,null,null,null,null,null,null,115523,"HOME-X Spring SET L=735 (42-48_45-51)"]
[115524,48,0.47366548013596455,2001,2250,1,54.667289140046798,{"$f":"IF(AND(F16=1,G16<=KG_MAX),MAX($H15:H15)+1,0)","v":4},null,{"$f":"F1","v":"SELECT,H"},"Keuze van het hoogte bereik. Het kunststof voetje heeft hier invloed op.",null,null,null,null,null,null,null,115524,"HOME-X Spring SET L=735, 2125_2250 (1,9 / 3,4 / --)"]
[115525,52,0.52460556156868476,2001,2250,1,60.418510107032425,{"$f":"IF(AND(F17=1,G17<=KG_MAX),MAX($H16:H16)+1,0)","v":5},null,null,"Door het voetje verschuift je bereik 8mm",null,null,null,null,null,null,null,115525,"HOME-X Spring SET L=735, 2125_2250 (2,1 / 3,4 / --)"]
[115526,56,0.57978267014220508,2001,2250,1,66.611470307302923,{"$f":"IF(AND(F18=1,G18<=KG_MAX),MAX($H17:H17)+1,0)","v":6},null,{"$f":"G1","v":"KG@DH"},{"$f":"_xlfn.FORMULATEXT(G2)","v":"=(((C2*VEERWEG)+B2)*CORRECTION_FACTOR)/9,81"},null,null,null,null,null,null,null,115526,"HOME-X Spring SET L=735, 2125_2250 (2,3 / 3,4 / --)"]
[115527,69,0.65759055084958584,2001,2250,1,76.1546699069238,{"$f":"IF(AND(F19=1,G19<=KG_MAX),MAX($H18:H18)+1,0)","v":7},null,{"$f":"H1","v":"RESULT_ID"},"Keuze op basis van het gewicht mits het in het hoogte bereik valt.",null,null,null,null,null,null,null,115527,"HOME-X Spring SET L=735, 2125_2250 (-- / 3,4 / 3,8)"]
[115528,78,0.75400174721771673,2001,2250,1,87.197026196166348,{"$f":"IF(AND(F20=1,G20<=KG_MAX),MAX($H19:H19)+1,0)","v":0},null,null,"Max waarde is RESULT_ID. Als KG>130 dan geen veer",null,null,null,null,null,null,null,115527,"HOME-X Spring SET L=735, 2125_2250 (-- / 3,4 / 3,8)"]
[115529,85,0.86504490096348219,2001,2250,1,99.544681234394602,{"$f":"IF(AND(F21=1,G21<=KG_MAX),MAX($H20:H20)+1,0)","v":0},null,null,null,null,null,null,null,null,null,null,115528,"HOME-X Spring SET L=735, 2125_2250 (-- / 3,2 / 4,3)"]
[115530,99,0.98794103460418681,2001,2250,1,113.89873318570622,{"$f":"IF(AND(F22=1,G22<=KG_MAX),MAX($H21:H21)+1,0)","v":0},null,null,null,null,null,null,null,null,null,null,115529,"HOME-X Spring SET L=735, 2125_2250 (-- / 3,4 / 4,3)"]
[115531,108,1.1271466784989204,2001,2250,1,129.4027050868049,{"$f":"IF(AND(F23=1,G23<=KG_MAX),MAX($H22:H22)+1,0)","v":0},null,null,null,null,null,null,null,null,null,null,115530,"HOME-X Spring SET L=735, 2125_2250 (2,1 / 3,4 / 4,3)"]
[115541,41,0.3222367449861821,2251,2500,0,38.109159358008931,{"$f":"IF(AND(F24=1,G24<=KG_MAX),MAX($H23:H23)+1,0)","v":0},null,null,null,null,null,null,null,null,null,null,115531,"HOME-X Spring SET L=735, 2125_2250 (2,0 / 3,4 / 4,5)"]
[115542,45,0.36756149249679232,2251,2500,0,43.274943125995854,{"$f":"IF(AND(F25=1,G25<=KG_MAX),MAX($H24:H24)+1,0)","v":0},null,null,null,null,null,null,null,null,null,null,115541,"HOME-X Spring SET L=820, 2375_2500 (1,9 / 3,2 / --)"]
[115543,48,0.42160304368957113,2251,2500,0,49.239421912736574,{"$f":"IF(AND(F26=1,G26<=KG_MAX),MAX($H25:H25)+1,0)","v":0},null,null,null,null,null,"KabelX",null,null,null,null,115542,"HOME-X Spring SET L=820, 2375_2500 (2,1 / 3,2 / --)"]
[115544,52,0.46692779120018135,2251,2500,0,54.405205680723491,{"$f":"IF(AND(F27=1,G27<=KG_MAX),MAX($H26:H26)+1,0)","v":0},null,null,null,null,null,{"$f":"VLOOKUP(1,M28:P37,4,0)","v":"115211-2125"},null,"Cable SET",null,null,115543,"HOME-X Spring SET L=820, 2375_2500 (1,9 / 3,4 / --)"]
[115545,62,0.48540756884791642,2251,2500,0,57.432767086125899,{"$f":"IF(AND(F28=1,G28<=KG_MAX),MAX($H27:H27)+1,0)","v":0},null,null,null,null,{"$f":"IF(AND(DH-IF(VOETJE=TRUE,8,0)>=N28,DH-IF(VOETJE=TRUE,8,0)<=O28),1,0)","v":0},{"$f":"O28-124","v":1751},1875,"115211-1875",null,null,115544,"HOME-X Spring SET L=820, 2375_2500 (2,1 / 3,4 / --)"]
[115546,69,0.55543440218206153,2251,2500,0,65.50418849905455,{"$f":"IF(AND(F29=1,G29<=KG_MAX),MAX($H28:H28)+1,0)","v":0},null,null,null,null,{"$f":"IF(AND(DH-IF(VOETJE=TRUE,8,0)>=N29,DH-IF(VOETJE=TRUE,8,0)<=O29),1,0)","v":0},1876,2000,"115211-2000",null,null,115545,"HOME-X Spring SET L=820, 2375_2500 (-- / 3,2 / 3,8)"]
[115547,69,0.58477386755130545,2251,2500,0,68.563029640853529,{"$f":"IF(AND(F30=1,G30<=KG_MAX),MAX($H29:H29)+1,0)","v":0},null,null,null,null,1,2001,2125,"115211-2125",null,null,115546,"HOME-X Spring SET L=820, 2375_2500 (-- / 3,2 / 4,0)"]
[115548,78,0.66908318509783193,2251,2500,0,78.343681793135431,{"$f":"IF(AND(F31=1,G31<=KG_MAX),MAX($H30:H30)+1,0)","v":0},null,null,null,null,0,2126,2250,"115211-2250",null,null,115547,"HOME-X Spring SET L=820, 2375_2500 (-- / 3,4 / 3,8)"]
[115549,85,0.76844948380122102,2251,2500,0,89.473944347863082,{"$f":"IF(AND(F32=1,G32<=KG_MAX),MAX($H31:H31)+1,0)","v":0},null,null,null,null,0,2251,2375,"115211-2375",null,null,115548,"HOME-X Spring SET L=820, 2375_2500 (-- / 3,2 / 4,3)"]
[115550,99,0.87790897349720853,2251,2500,0,102.42713371396584,{"$f":"IF(AND(F33=1,G33<=KG_MAX),MAX($H32:H32)+1,0)","v":0},null,null,null,null,0,2376,2500,"115211-2500",null,null,115549,"HOME-X Spring SET L=820, 2375_2500 (-- / 3,4 / 4,3)"]
[115551,108,1.0008089231009465,2251,2500,{"$f":"IF(AND((DH-IF(VOETJE=TRUE,8,0))>=D34,(DH-IF(VOETJE=TRUE,8,0))<=E34),1,0)","v":0},{"$f":"(((C34*VEERWEG)+B34)*CORRECTION_FACTOR)/9.81","v":116.23112479008401},{"$f":"IF(AND(F34=1,G34<=KG_MAX),MAX($H33:H33)+1,0)","v":0},null,null,null,null,0,2501,2625,"115211-2625",null,null,115550,"HOME-X Spring SET L=820, 2375_2500 (2,1 / 3,4 / 4,3)"]
[115561,43,0.30906316424261154,2501,2750,0,36.955906407826035,{"$f":"IF(AND(F35=1,G35<=KG_MAX),MAX($H34:H34)+1,0)","v":0},null,null,null,null,0,2626,2750,"115211-2750",null,null,115551,"HOME-X Spring SET L=820, 2375_2500 (2,0 / 3,4 / 4,5)"]
[115562,45,0.3318776518743129,2501,2750,0,39.554657210088912,{"$f":"IF(AND(F36=1,G36<=KG_MAX),MAX($H35:H35)+1,0)","v":0},null,null,null,null,0,2751,2875,"115211-2875",null,null,115561,"HOME-X Spring SET L=905, 2625_2750 (2,0 / 3,2 / --)"]
[115563,49,0.3761613908578656,2501,2750,0,44.611908676227387,{"$f":"IF(AND(F37=1,G37<=KG_MAX),MAX($H36:H36)+1,0)","v":0},null,null,null,null,0,2876,3000,"115211-3000",null,null,115562,"HOME-X Spring SET L=905, 2625_2750 (2,1 / 3,2 / --)"]
[115564,52,0.42091435379110159,2501,2750,0,49.607988224606224,{"$f":"IF(AND(F38=1,G38<=KG_MAX),MAX($H37:H37)+1,0)","v":0},null,null,null,null,null,null,null,null,null,null,115563,"HOME-X Spring SET L=905, 2625_2750 (2,3 / 3,2 / --)"]
[115565,56,0.46519809277465424,2501,2750,0,54.665239690744684,{"$f":"IF(AND(F39=1,G39<=KG_MAX),MAX($H38:H38)+1,0)","v":0},null,null,null,null,null,null,null,null,null,null,115564,"HOME-X Spring SET L=905, 2625_2750 (2,1 / 3,4 / --)"]
[115566,69,0.52554697867897271,2501,2750,0,62.388218951448131,{"$f":"IF(AND(F40=1,G40<=KG_MAX),MAX($H39:H39)+1,0)","v":0},null,null,null,null,null,null,null,null,null,null,115565,"HOME-X Spring SET L=905, 2625_2750 (2,3 / 3,4 / --)"]
[115567,78,0.60222567883703138,2501,2750,0,71.373326736734185,{"$f":"IF(AND(F41=1,G41<=KG_MAX),MAX($H40:H40)+1,0)","v":0},null,null,null,null,null,null,null,null,null,null,115566,"HOME-X Spring SET L=905, 2625_2750 (-- / 3,4 / 3,8)"]
[115568,85,0.69126238075382007,2501,2750,0,81.426657751251483,{"$f":"IF(AND(F42=1,G42<=KG_MAX),MAX($H41:H41)+1,0)","v":0},null,null,null,null,null,null,null,null,null,null,115567,"HOME-X Spring SET L=905, 2625_2750 (-- / 3,2 / 4,3)"]
[115569,99,0.79017155818995344,2501,2750,0,93.279904470372756,{"$f":"IF(AND(F43=1,G43<=KG_MAX),MAX($H42:H42)+1,0)","v":0},null,null,null,null,null,null,null,null,null,null,115568,"HOME-X Spring SET L=905, 2625_2750 (-- / 3,4 / 4,3)"]
[115570,108,0.90011831037345558,2501,2750,0,105.73343558792612,{"$f":"IF(AND(F44=1,G44<=KG_MAX),MAX($H43:H43)+1,0)","v":0},null,null,null,null,null,null,null,null,null,null,115569,"HOME-X Spring SET L=905, 2625_2750 (2,1 / 3,4 / 4,3)"]
[115581,43,0.28083705295338507,2751,3000,0,34.013140089562093,{"$f":"IF(AND(F45=1,G45<=KG_MAX),MAX($H44:H44)+1,0)","v":0},null,null,null,null,null,null,null,null,null,null,115570,"HOME-X Spring SET L=905, 2625_2750 (2,0 / 3,4 / 4,5)"]
[115582,45,0.30158943816967915,2751,3000,0,36.396902526240673,{"$f":"IF(AND(F46=1,G46<=KG_MAX),MAX($H45:H45)+1,0)","v":0},null,null,null,null,null,null,null,null,null,null,115581,"HOME-X Spring SET L=990, 2875_3000 (2,0 / 3,2 / --)"]
[115583,49,0.34199324982732776,2751,3000,0,41.04964487190599,{"$f":"IF(AND(F47=1,G47<=KG_MAX),MAX($H46:H46)+1,0)","v":0},null,null,null,null,null,null,null,null,null,null,115582,"HOME-X Spring SET L=990, 2875_3000 (2,1 / 3,2 / --)"]
[115584,52,0.3829593650442778,2751,3000,0,45.650919489570398,{"$f":"IF(AND(F48=1,G48<=KG_MAX),MAX($H47:H47)+1,0)","v":0},null,null,null,null,null,null,null,null,null,null,115583,"HOME-X Spring SET L=990, 2875_3000 (2,3 / 3,2 / --)"]
[115585,56,0.42336317670192641,2751,3000,0,50.303661835235701,{"$f":"IF(AND(F49=1,G49<=KG_MAX),MAX($H48:H48)+1,0)","v":0},null,null,null,null,null,null,null,null,null,null,115584,"HOME-X Spring SET L=990, 2875_3000 (2,1 / 3,4 / --)"]
[115586,69,0.47798133944649313,2751,3000,0,57.429173774953647,{"$f":"IF(AND(F50=1,G50<=KG_MAX),MAX($H49:H49)+1,0)","v":0},null,null,null,null,null,null,null,null,null,null,115585,"HOME-X Spring SET L=990, 2875_3000 (2,3 / 3,4 / --)"]
[115587,78,0.54679769279360457,2751,3000,0,65.594577806481851,{"$f":"IF(AND(F51=1,G51<=KG_MAX),MAX($H50:H50)+1,0)","v":0},null,null,null,null,null,null,null,null,null,null,115586,"HOME-X Spring SET L=990, 2875_3000 (-- / 3,4 / 3,8)"]
[115588,85,0.62816761966820323,2751,3000,0,74.848594769811569,{"$f":"IF(AND(F52=1,G52<=KG_MAX),MAX($H51:H51)+1,0)","v":0},null,null,null,null,null,null,null,null,null,null,115587,"HOME-X Spring SET L=990, 2875_3000 (-- / 3,2 / 4,3)"]
[115589,99,0.71818364737871931,2751,3000,0,85.774669438640061,{"$f":"IF(AND(F53=1,G53<=KG_MAX),MAX($H52:H52)+1,0)","v":0},null,null,null,null,null,null,null,null,null,null,115588,"HOME-X Spring SET L=990, 2875_3000 (-- / 3,4 / 4,3)"]
[115590,108,0.81769688531000462,2751,3000,0,97.140434905164156,{"$f":"IF(AND(F54=1,G54<=KG_MAX),MAX($H53:H53)+1,0)","v":0},null,null,null,null,null,null,null,null,null,null,115589,"HOME-X Spring SET L=990, 2875_3000 (2,1 / 3,4 / 4,3)"]
[null,null,null,null,null,null,null,null,null,null,null,null,null,null,null,null,null,null,115590,"HOME-X Spring SET L=990, 2875_3000 (2,0 / 3,4 / 4,5)"]

{"sheet":"SpringCalculation","index":2,"n_rows":263,"n_cols":29,"rows_kept":263,"cut":false,"hidden":true,"merged":[]}
[]
[null,"DH",{"$f":"DH","v":2125},"mm",null,"Cable",3,"mm",null,"DRUM","HMA","LMA","REV_S",null,"Di","inactive","art nb",null,"RESULTS","ITEM","QTY","RST","ELT","MIN DW","ZAGEN","MASS"]
[null,null,null,null,null,null,null,null,null,"M76",{"$f":"1.5*25.4","v":38.099999999999994},{"$f":"1.5*25.4","v":38.099999999999994},0,null,50.8,8,329,null,1,{"$f":"_xlfn.IFNA(INDEX(SC_TABLE,MATCH($S3,$W$26:$W$156,0),MATCH(T$2,$B$25:$V$25,0)),NOSP)","v":3295004482},{"$f":"_xlfn.IFNA(INDEX(SC_TABLE,MATCH($S3,$W$26:$W$156,0),MATCH(U$2,$B$25:$V$25,0)),0)","v":2},7.4136768222859635,{"$f":"_xlfn.IFNA(INDEX(SC_TABLE,MATCH($S3,$W$26:$W$156,0),MATCH(W$2,$B$25:$V$25,0)),\"\")","v":10833},{"$f":"_xlfn.IFNA(INDEX(SC_TABLE,MATCH($S3,$W$26:$W$156,0),MATCH(X$2,$B$25:$V$25,0)),0)","v":1344.1367682228597},"Ex_Center",4.7879249685086567,0,0,0]
[null,"DW",{"$f":"DW","v":2500},"mm",null,"Drum","M102","[-]",null,"M102",{"$f":"2.1875*25.4","v":55.5625},{"$f":"2*25.4","v":50.8},0.75,null,66.674999999999997,7,339,null,2,{"$f":"_xlfn.IFNA(INDEX(SC_TABLE,MATCH($S4,$W$26:$W$156,0),MATCH(T$2,$B$25:$V$25,0)),\"\")","v":3295305512},2,7.3318609396221985,18333,1553.7177259599953,"Ex_Center",6.2853879863173105,0,0,0]
[null,null,null,null,null,"HMA",{"$f":"INDEX($K$3:$M$4,MATCH($G$4,$J$3:$J$4,0),MATCH($F5,$K$2:$M$2,0))+($G$2/2)","v":57.0625},"mm",null,null,null,null,null,null,null,null,null,null,3,3295306002,2,7.4529015909382741,26667,1653.0007568639458,"Ex_Center",6.8497713678997707,0,0,0]
[null,"Weight",{"$f":"KG","v":75},"KG",null,"LMA",{"$f":"INDEX($K$3:$M$4,MATCH($G$4,$J$3:$J$4,0),MATCH($F6,$K$2:$M$2,0))+($G$2/2)","v":52.3},"mm",null,null,null,null,null,null,"draad","Rm",null,null,4,3295506982,2,7.4244471262800475,41500,1851.6689183890805,"Ex_Center",8.3067333292907879,0,0,0]
[null,null,null,null,null,"REV_S",{"$f":"INDEX($K$3:$M$4,MATCH($G$4,$J$3:$J$4,0),MATCH($F7,$K$2:$M$2,0))","v":0.75},"rev",null,null,null,null,null,null,5,1660,null,null,5,3396008112,2,7.4017222560025173,93750,2084.8206670720301,"Center",13.597891691765584,0,0,0]
[null,"Lifetime",{"$f":"O15/1.5","v":10000},"cycles",null,"CCSP",{"$f":"PI()*(G6+G5)*G7","v":257.67931993366034},"mm",null,"SBD-DW",87,"mm",null,null,5.3,1640,null,null,6,"",0,0,"",0,0,0,0,0,0]
[null,null,null,null,null,"CIRF",{"$f":"PI()*G6*2","v":328.61059156549231},"mm",null,"Veerkop",50,"mm/veer",null,null,5.5,1630,null,null,7,"",0,0,"",0,0,0,0,0,0]
[null,"ODW",{"$f":"(303/SC_DH)*SC_W","v":10.694117647058825},"KG",null,null,null,null,null,"4veren beugel",116,"mm",null,null,6,1590,null,null,8,"",0,0,"",0,0,0,0,0,0]
[null,"HMT",{"$f":"SC_W*9.81*G5","v":41983.734375},"Nmm",null,"DH_not_active",113,"mm",null,"extra ruimte",50,"mm/veer",null,null,6.5,1560,null,null,9,"",0,0,"",0,0,0,0,0,0]
[null,"LMT",{"$f":"C10*9.81*G6","v":5486.756082352942},"Nmm",null,null,null,null,null,null,null,null,null,null,7,1540,null,null,10,"",0,0,"",0,0,0,0,0,0]
[null,null,null,null,null,"SBD torque",{"$f":"21*46.7","v":980.7},"Nmm",null,"No cut",0,"mm",null,null,7.5,1510,null,null,11,"",0,0,"",{"$f":"_xlfn.IFNA(INDEX(SC_TABLE,MATCH($S13,$W$26:$W$156,0),MATCH(X$2,$B$25:$V$25,0)),0)","v":0},0,0,0,0,0]
[null,null,null,null,null,"tol. +",0.75,"turns",null,"Center",150,"mm",null,null,null,null,null,null,12,"",0,0,"",0,0,0,0,0,0]
[null,"RDT",{"$f":"((SC_DH-G8-G11)/G9)+G7","v":6.0886005353899328},"turns",null,"tol. -",0,"turns",null,"Ex_Center",490,"mm",null,"Min. lifetime Step 1",{"$f":"Lifetime","v":15000},"if > …",null,null,13,"",0,0,"",0,0,0,0,0,0]
[null,null,null,null,null,null,null,null,null,null,null,null,null,"Min. lifetime Step 2",{"$f":"O15/1.2","v":12500},"elseif > … else > \"C8\"",null,null,14,"",0,0,"",0,0,0,0,0,0]
[null,"Results",{"$f":"MAX(W26:W156)","v":5},null,null,"No Cut DW",3000,null,null,null,null,null,null,"SELECTED RESULT:",{"$f":"IF(MAX(W3:W22)>=O15,INDEX(T3:T22,MIN(IF(W3:W22>=O15,ROW(W3:W22)-2,\"\"))),IF(MAX(W3:W22)>=O16,INDEX(T3:T22,MIN(IF(W3:W22>=O16,ROW(W3:W22)-2,\"\"))),T3))","v":3295305512},null,null,null,15,"",0,0,"",0,0,0,0,0,0]
[null,null,null,null,null,null,null,null,215,null,null,null,null,"SELECTED QTY:",{"$f":"VLOOKUP(SC_RESULT_ITEM,$T$3:$AA$22,2,0)","v":2},null,null,null,16,"",0,0,"",0,0,0,0,0,0]
[null,"Density",10.5,"KG/m²",null,null,null,"No cut",{"$f":"\"L = \"&DW+I18","v":"L = 2715"},null,null,null,null,"SELECTED RST:",{"$f":"IFERROR(ROUND(VLOOKUP(SC_RESULT_ITEM,$T$3:$AA$22,3,0),1),\"\")","v":7.3},null,null,null,17,"",0,0,"",0,0,0,0,0,0]
[null,"Additional",5.5,"KG",null,null,null,"Center",{"$f":"\"L = \"&ROUND((DW+I18)/2,0)&\";L = \"&ROUND((DW+I18)/2,0)","v":"L = 1358;L = 1358"},null,null,null,null,"SELECTED ELT:",{"$f":"VLOOKUP(SC_RESULT_ITEM,$T$3:$AA$22,4,0)","v":18333},null,null,null,18,"",0,0,"",0,0,0,0,0,0]
[null,"endcap",{"$f":"2*0.768","v":1.536},"KG/mtr",null,null,null,"Ex_Center",{"$f":"\"L = \"&ROUND((DW+I18)/2,0)-200&\";L = \"&ROUND((DW+I18)/2,0)+200","v":"L = 1158;L = 1558"},null,null,null,null,"SELECTED min DW:",{"$f":"IFERROR(ROUND(VLOOKUP(SC_RESULT_ITEM,$T$3:$AA$22,5,0),0),\"\")","v":1554},null,null,null,19,"",0,0,"",0,0,0,0,0,0]
[null,"alu/seal",1,"KG/mtr",null,null,null,null,{"$f":"VLOOKUP(SC_RESULT_BUILD,H19:I21,2,0)","v":"L = 2715"},null,null,null,null,"SELECTED BUILD:",{"$f":"IF(DW>SC_NOCUTDW,VLOOKUP(SC_RESULT_ITEM,$T$3:$AA$22,6,0),\"No cut\")","v":"No cut"},null,null,null,20,"",0,0,"",0,0,0,0,0,0]
[null,null,{"$f":"(((SC_DH+20)*(SC_DW+20)*$C$19)/1000000)+$C$20+(SC_DH*$C$21/1000)+((SC_DW+20)*$C$22/1000)","v":68.040700000000001},null,null,null,null,null,null,null,null,null,null,"SELECTED MASS:",{"$f":"IFERROR(ROUND(VLOOKUP(SC_RESULT_ITEM,$T$3:$AA$22,7,0),3),\"\")","v":6.2850000000000001}]
[]
[null,"USE M102","ITEM","D","d","L","nw","nw,act","MF","MB","TPST","MASS","QTY","PRE-TURN","RST","KG-","KG+",null,"ELT","MIN DW","RUIMTE","ZAGEN"]
[null,"X",3295004482,{"$f":"INDEX($O$3:$O$4,MATCH(VALUE(LEFT(C26,3)),$Q$3:$Q$4,0))","v":50.8},{"$f":"VALUE(RIGHT(LEFT(C26,5),2))/10","v":5},{"$f":"VALUE(RIGHT(LEFT(C26,9),4))","v":448},{"$f":"(F26/E26)-1","v":88.6},{"$f":"G26-VLOOKUP(D26,$O$3:$P$4,2,0)","v":80.599999999999994},{"$f":"(($E26^4)*206000*PI())/(32*($D26+$E26))","v":226523.32781680438},{"$f":"((E26^3)*VLOOKUP(E26,$O$7:$P$13,2,0)*PI())/32","v":20371.264863121316},{"$f":"I26/H26","v":2810.4631242779701},{"$f":"((PI()*((E26/2)^2))*(PI()*(D26+E26)))*G26*(7.85/1000000)*M26","v":4.7879249685086567},2,{"$f":"((SC_LMT/M26)+SC_SBD)/K26","v":1.3250762868960309},{"$f":"N26+SC_RDT","v":7.4136768222859635},{"$f":"((((O26+SC_TOL_MIN)*K26)-SC_SBD)*M26)/(SC_HMA*9.81)","v":70.938777671616947},{"$f":"((((O26+SC_TOL_PLUS)*K26)-SC_SBD)*M26)/(SC_HMA*9.81)","v":78.469720456676711},{"$f":"IF(AND(SC_W>=P26,SC_W<=Q26),1,0)","v":1},{"$f":"_xlfn.IFNA(VLOOKUP(ROUND(VLOOKUP(ROUND(1-(SC_RDT/O26),2),SC_LT_TABLE,2,0)-(($I26*O26)/($H26*J26)),2),SC_LT_TABLE,3,0),0)","v":10833},{"$f":"((F26+(O26*E26)+$K$9+$K$8+$K$11)*M26)+IF(M26=4,$K$10,0)","v":1344.1367682228597},{"$f":"SC_DW-T26","v":1155.8632317771403},{"$f":"IF(U26>=$K$15,$J$15,IF(U26>=$K$14,$J$14,IF(AND(U26>=$K$13,M26=4),$J$14,IF(U26>=$K$13,$J$13,0))))","v":"Ex_Center"},{"$f":"IF(AND(R26=1,S26>=SC_LT,V26<>0,OR(IF(AND($G$4=$J$4,B26=\"X\"),TRUE,FALSE),IF(AND($G$4=$J$3,A26=\"X\",D26<>$O$4),TRUE,FALSE))),MAX($W$25:W25)+1,0)","v":1}]
[null,"X",3295004902,50.8,5,490,97,89,226523.32781680438,20371.264863121316,2545.2059305258917,5.2418591641686199,2,1.463173567416213,7.5517741028061458,65.168524801293515,71.988681975179105,0,16667,1429.5177410280614,1070.4822589719386,{"$f":"IF(U27>=$K$15,$J$15,IF(U27>=$K$14,$J$14,IF(AND(U27>=$K$13,M27=4),$J$14,IF(U27>=$K$13,$J$13,0))))","v":"Ex_Center"},{"$f":"IF(AND(R27=1,S27>=SC_LT,V27<>0,OR(IF(AND($G$4=$J$4,B27=\"X\"),TRUE,FALSE),IF(AND($G$4=$J$3,A27=\"X\",D27<>$O$4),TRUE,FALSE))),MAX($W$25:W26)+1,0)","v":0}]
[null,"X",3295005332,50.8,5,533,105.6,97.6,226523.32781680438,20371.264863121316,2320.935735827914,5.706601316868106,2,1.6045588784249702,7.6931594138149029,60.289879602726259,66.509080304322751,0,23750,1516.931594138149,983.06840586185103,"Ex_Center",{"$f":"IF(AND(R28=1,S28>=SC_LT,V28<>0,OR(IF(AND($G$4=$J$4,B28=\"X\"),TRUE,FALSE),IF(AND($G$4=$J$3,A28=\"X\",D28<>$O$4),TRUE,FALSE))),MAX($W$25:W27)+1,0)","v":0}]
[null,"X",3295005762,50.8,5,576,114.2,106.2,226523.32781680438,20371.264863121316,2132.9880208738641,6.1713434695675913,2,1.7459441894337282,7.8345447248236608,56.201372797900582,61.916947077333887,0,35000,1604.3454472482367,895.65455275176328,"Ex_Center",{"$f":"IF(AND(R29=1,S29>=SC_LT,V29<>0,OR(IF(AND($G$4=$J$4,B29=\"X\"),TRUE,FALSE),IF(AND($G$4=$J$3,A29=\"X\",D29<>$O$4),TRUE,FALSE))),MAX($W$25:W28)+1,0)","v":0}]
[null,"X",3295006192,50.8,5,619,122.8,114.8,226523.32781680438,20371.264863121316,1973.1997196585748,6.6360856222670774,2,1.8873295004424857,7.9759300358324188,52.725429730383297,58.0128338111831,0,56250,1691.7593003583243,808.24069964167575,"Ex_Center",{"$f":"IF(AND(R30=1,S30>=SC_LT,V30<>0,OR(IF(AND($G$4=$J$4,B30=\"X\"),TRUE,FALSE),IF(AND($G$4=$J$3,A30=\"X\",D30<>$O$4),TRUE,FALSE))),MAX($W$25:W29)+1,0)","v":0}]
[null,"X",3295006632,50.8,5,663,131.6,123.6,226523.32781680438,20371.264863121316,1832.7130082265728,7.1116357320060857,2,2.0320028419398191,8.1206033773297523,49.669362377727538,54.580316977046436,0,71875,1781.2060337732976,718.79396622670242,"Ex_Center",{"$f":"IF(AND(R31=1,S31>=SC_LT,V31<>0,OR(IF(AND($G$4=$J$4,B31=\"X\"),TRUE,FALSE),IF(AND($G$4=$J$3,A31=\"X\",D31<>$O$4),TRUE,FALSE))),MAX($W$25:W30)+1,0)","v":0}]
[null,"X",3295305032,50.8,5.3,503,93.905660377358487,85.905660377358487,284451.17487941781,23970.183086284989,3311.2041002875344,5.7325226329304115,2,1.1246899702899873,7.2132905056799199,81.831609693387918,90.704342594064954,0,12500,1456.4608793602072,1043.5391206397928,"Ex_Center",{"$f":"IF(AND(R32=1,S32>=SC_LT,V32<>0,OR(IF(AND($G$4=$J$4,B32=\"X\"),TRUE,FALSE),IF(AND($G$4=$J$3,A32=\"X\",D32<>$O$4),TRUE,FALSE))),MAX($W$25:W31)+1,0)","v":0}]
[null,"X",3295305512,50.8,5.3,551,102.9622641509434,94.962264150943398,284451.17487941781,23970.183086284989,2995.4127297057707,6.2853879863173105,2,1.2432604042322657,7.3318609396221985,74.962065321196832,82.988600766613587,1,18333,1553.7177259599953,946.28227404000472,"Ex_Center",{"$f":"IF(AND(R33=1,S33>=SC_LT,V33<>0,OR(IF(AND($G$4=$J$4,B33=\"X\"),TRUE,FALSE),IF(AND($G$4=$J$3,A33=\"X\",D33<>$O$4),TRUE,FALSE))),MAX($W$25:W32)+1,0)","v":2}]
[null,"X",3295306002,50.8,5.3,600,112.20754716981132,104.20754716981132,284451.17487941781,23970.183086284989,2729.6600160436619,6.8497713678997707,2,1.3643010555483415,7.4529015909382741,69.181033194926698,76.495455229469982,1,26667,1653.0007568639458,846.99924313605425,"Ex_Center",{"$f":"IF(AND(R34=1,S34>=SC_LT,V34<>0,OR(IF(AND($G$4=$J$4,B34=\"X\"),TRUE,FALSE),IF(AND($G$4=$J$3,A34=\"X\",D34<>$O$4),TRUE,FALSE))),MAX($W$25:W33)+1,0)","v":3}]
[null,"X",3295306492,50.8,5.3,649,121.45283018867924,113.45283018867924,284451.17487941781,23970.183086284989,2507.2197353416173,7.41415474948223,2,1.4853417068644175,7.5739422422543505,64.342194895988143,71.060563912582609,0,41500,1752.2837877678962,747.71621223210377,"Ex_Center",{"$f":"IF(AND(R35=1,S35>=SC_LT,V35<>0,OR(IF(AND($G$4=$J$4,B35=\"X\"),TRUE,FALSE),IF(AND($G$4=$J$3,A35=\"X\",D35<>$O$4),TRUE,FALSE))),MAX($W$25:W34)+1,0)","v":0}]
[null,"X",3295306972,50.8,5.3,697,130.50943396226415,122.50943396226415,284451.17487941781,23970.183086284989,2321.8715953502456,7.9670201028691299,2,1.6039121408066959,7.6925126761966283,60.310237754068233,66.531946193431025,0,56250,1849.5406343676843,650.45936563231567,"Ex_Center",{"$f":"IF(AND(R36=1,S36>=SC_LT,V36<>0,OR(IF(AND($G$4=$J$4,B36=\"X\"),TRUE,FALSE),IF(AND($G$4=$J$3,A36=\"X\",D36<>$O$4),TRUE,FALSE))),MAX($W$25:W35)+1,0)","v":0}]
[null,"X",3295307462,50.8,5.3,746,139.75471698113208,131.75471698113208,284451.17487941781,23970.183086284989,2158.9449045695465,8.5314034844515891,2,1.7249527921227721,7.8135533275127047,56.766023959782551,62.551152543025069,0,75000,1948.8236652716346,551.17633472836542,"Ex_Center",{"$f":"IF(AND(R37=1,S37>=SC_LT,V37<>0,OR(IF(AND($G$4=$J$4,B37=\"X\"),TRUE,FALSE),IF(AND($G$4=$J$3,A37=\"X\",D37<>$O$4),TRUE,FALSE))),MAX($W$25:W36)+1,0)","v":0}]
[null,"X",3295307952,50.8,5.3,795,149,141,284451.17487941781,23970.183086284989,2017.3842190029632,9.0957868660340502,2,1.8459934434388479,7.9345939788287811,53.686593989717402,59.09239526052999,0,84375,2048.1066961755851,451.89330382441494,"Center",{"$f":"IF(AND(R38=1,S38>=SC_LT,V38<>0,OR(IF(AND($G$4=$J$4,B38=\"X\"),TRUE,FALSE),IF(AND($G$4=$J$3,A38=\"X\",D38<>$O$4),TRUE,FALSE))),MAX($W$25:W37)+1,0)","v":0}]
[null,null,3295308442,50.8,5.3,844,158.24528301886792,150.24528301886792,284451.17487941781,23970.183086284989,1893.2452930565296,9.6601702476165094,2,1.9670340947549236,8.0556346301448567,50.986146987210184,56.059304452585359,0,96875,2147.3897270795355,352.61027292046447,"Center",{"$f":"IF(AND(R39=1,S39>=SC_LT,V39<>0,OR(IF(AND($G$4=$J$4,B39=\"X\"),TRUE,FALSE),IF(AND($G$4=$J$3,A39=\"X\",D39<>$O$4),TRUE,FALSE))),MAX($W$25:W38)+1,0)","v":0}]
[null,"X",3295505412,50.8,5.5,541,97.36363636363636,89.36363636363636,328707.39746922464,26624.138709932282,3678.3126878550065,6.4234739318920102,2,1.0124419420547284,7.1010424774446612,89.817479373934489,99.673919815547492,0,13750,1534.1114672518913,965.88853274810867,"Ex_Center",{"$f":"IF(AND(R40=1,S40>=SC_LT,V40<>0,OR(IF(AND($G$4=$J$4,B40=\"X\"),TRUE,FALSE),IF(AND($G$4=$J$3,A40=\"X\",D40<>$O$4),TRUE,FALSE))),MAX($W$25:W39)+1,0)","v":0}]
[null,"X",3295505932,50.8,5.5,593,106.81818181818181,98.818181818181813,328707.39746922464,26624.138709932282,3326.3858069562752,7.0472286367629424,2,1.1195568575925634,7.2081573929824962,82.16186383369066,91.075277774910148,0,20000,1639.2897313228075,860.71026867719252,"Ex_Center",{"$f":"IF(AND(R41=1,S41>=SC_LT,V41<>0,OR(IF(AND($G$4=$J$4,B41=\"X\"),TRUE,FALSE),IF(AND($G$4=$J$3,A41=\"X\",D41<>$O$4),TRUE,FALSE))),MAX($W$25:W40)+1,0)","v":0}]
[null,"X",3295506462,50.8,5.5,646,116.45454545454545,108.45454545454545,328707.39746922464,26624.138709932282,3030.8309909148961,7.6829786244198557,2,1.2287316753522799,7.3173322107422125,75.732533863493302,83.853976406750292,0,30000,1746.4906543181644,753.50934568183561,"Ex_Center",{"$f":"IF(AND(R42=1,S42>=SC_LT,V42<>0,OR(IF(AND($G$4=$J$4,B42=\"X\"),TRUE,FALSE),IF(AND($G$4=$J$3,A42=\"X\",D42<>$O$4),TRUE,FALSE))),MAX($W$25:W41)+1,0)","v":0}]
[null,"X",3295506982,50.8,5.5,698,125.90909090909091,117.90909090909091,328707.39746922464,26624.138709932282,2787.8036793843262,8.3067333292907879,2,1.3358465908901149,7.4244471262800475,70.445857102383727,77.916081430915384,1,41500,1851.6689183890805,648.33108161091945,"Ex_Center",{"$f":"IF(AND(R43=1,S43>=SC_LT,V43<>0,OR(IF(AND($G$4=$J$4,B43=\"X\"),TRUE,FALSE),IF(AND($G$4=$J$3,A43=\"X\",D43<>$O$4),TRUE,FALSE))),MAX($W$25:W42)+1,0)","v":4}]
[null,"X",3295507512,50.8,5.5,751,135.54545454545453,127.54545454545453,328707.39746922464,26624.138709932282,2577.1784548549331,8.9424833169476994,2,1.4450214086498312,7.5336219440397638,65.864036759599045,72.769867803152565,0,59375,1958.8698413844374,541.13015861556255,"Ex_Center",{"$f":"IF(AND(R44=1,S44>=SC_LT,V44<>0,OR(IF(AND($G$4=$J$4,B44=\"X\"),TRUE,FALSE),IF(AND($G$4=$J$3,A44=\"X\",D44<>$O$4),TRUE,FALSE))),MAX($W$25:W43)+1,0)","v":0}]
[null,"X",3295508042,50.8,5.5,804,145.18181818181819,137.18181818181819,328707.39746922464,26624.138709932282,2396.1440504714851,9.5782333046046144,2,1.5541962264095477,7.642796761799481,61.925918148206264,68.34664774005887,0,75000,2066.0707643797941,433.92923562020587,"Center",{"$f":"IF(AND(R45=1,S45>=SC_LT,V45<>0,OR(IF(AND($G$4=$J$4,B45=\"X\"),TRUE,FALSE),IF(AND($G$4=$J$3,A45=\"X\",D45<>$O$4),TRUE,FALSE))),MAX($W$25:W44)+1,0)","v":0}]
[null,"X",3295508572,50.8,5.5,857,154.81818181818181,146.81818181818181,328707.39746922464,26624.138709932282,2238.8739146510657,10.213983292261524,2,1.663371044169264,7.7519715795591964,58.504753806544279,64.50406089886971,0,87500,2173.2716873751515,326.72831262484851,"Center",{"$f":"IF(AND(R46=1,S46>=SC_LT,V46<>0,OR(IF(AND($G$4=$J$4,B46=\"X\"),TRUE,FALSE),IF(AND($G$4=$J$3,A46=\"X\",D46<>$O$4),TRUE,FALSE))),MAX($W$25:W45)+1,0)","v":0}]
[null,"X",3296006482,50.8,6,648,107,99,461449.07586090924,33717.143154652455,4661.1017763728205,8.4756696391489719,2,0.79896947542614627,6.8875700108160789,111.196509585054,123.68644068928162,0,15833,1752.6508401297929,747.34915987020713,"Ex_Center",{"$f":"IF(AND(R47=1,S47>=SC_LT,V47<>0,OR(IF(AND($G$4=$J$4,B47=\"X\"),TRUE,FALSE),IF(AND($G$4=$J$3,A47=\"X\",D47<>$O$4),TRUE,FALSE))),MAX($W$25:W46)+1,0)","v":0}]
[null,"X",3296007112,50.8,6,711,117.5,109.5,461449.07586090924,33717.143154652455,4214.1468115151529,9.307394229906583,2,0.88370866221376776,6.9723091976037006,101.47370760409902,112.76597408189384,0,23750,1879.6677103712443,620.33228962875569,"Ex_Center",{"$f":"IF(AND(R48=1,S48>=SC_LT,V48<>0,OR(IF(AND($G$4=$J$4,B48=\"X\"),TRUE,FALSE),IF(AND($G$4=$J$3,A48=\"X\",D48<>$O$4),TRUE,FALSE))),MAX($W$25:W47)+1,0)","v":0}]
[null,"X",3296007752,50.8,6,775,128.16666666666666,120.16666666666666,461449.07586090924,33717.143154652455,3840.0755272752508,10.152320798295266,2,0.96979291545833557,7.0583934508482686,93.336375413182878,103.62627704412769,0,35000,2008.7007214101793,491.29927858982069,"Ex_Center",{"$f":"IF(AND(R49=1,S49>=SC_LT,V49<>0,OR(IF(AND($G$4=$J$4,B49=\"X\"),TRUE,FALSE),IF(AND($G$4=$J$3,A49=\"X\",D49<>$O$4),TRUE,FALSE))),MAX($W$25:W48)+1,0)","v":0}]
[null,"X",3296008382,50.8,6,838,138.66666666666666,130.66666666666666,461449.07586090924,33717.143154652455,3531.4980295477749,10.984045389052874,2,1.0545321022459573,7.1431326376358903,86.623757493974281,96.086792029575292,0,53125,2135.7175916516308,364.28240834836924,"Center",{"$f":"IF(AND(R50=1,S50>=SC_LT,V50<>0,OR(IF(AND($G$4=$J$4,B50=\"X\"),TRUE,FALSE),IF(AND($G$4=$J$3,A50=\"X\",D50<>$O$4),TRUE,FALSE))),MAX($W$25:W49)+1,0)","v":0}]
[null,"X",3296009022,50.8,6,902,149.33333333333334,141.33333333333334,461449.07586090924,33717.143154652455,3264.9698763743577,11.828971957441558,2,1.1406163554905253,7.2292168908804584,80.825856901282577,89.574700151177851,0,68750,2264.7506026905658,235.24939730943424,"Center",{"$f":"IF(AND(R51=1,S51>=SC_LT,V51<>0,OR(IF(AND($G$4=$J$4,B51=\"X\"),TRUE,FALSE),IF(AND($G$4=$J$3,A51=\"X\",D51<>$O$4),TRUE,FALSE))),MAX($W$25:W50)+1,0)","v":0}]
[null,"X",3296009662,50.8,6,966,160,152,461449.07586090924,33717.143154652455,3035.8491832954555,12.673898525830239,2,1.2267006087350931,7.3153011441250264,75.841696742652857,83.976586080274785,0,81250,2393.7836137295003,106.2163862704997,"No cut",{"$f":"IF(AND(R52=1,S52>=SC_LT,V52<>0,OR(IF(AND($G$4=$J$4,B52=\"X\"),TRUE,FALSE),IF(AND($G$4=$J$3,A52=\"X\",D52<>$O$4),TRUE,FALSE))),MAX($W$25:W51)+1,0)","v":0}]
[null,"X",3296010302,50.8,6,1030,170.66666666666666,162.66666666666666,461449.07586090924,33717.143154652455,2836.777105702311,13.518825094218922,2,1.3127848619796612,7.4013853973695944,71.51119693269591,79.112650903916403,1,93750,2522.8166247684353,-22.816624768435304,0,{"$f":"IF(AND(R53=1,S53>=SC_LT,V53<>0,OR(IF(AND($G$4=$J$4,B53=\"X\"),TRUE,FALSE),IF(AND($G$4=$J$3,A53=\"X\",D53<>$O$4),TRUE,FALSE))),MAX($W$25:W52)+1,0)","v":0}]
[null,"X",3296010942,50.8,6,1094,181.33333333333334,173.33333333333334,461449.07586090924,33717.143154652455,2662.2062068898608,14.363751662607607,2,1.3988691152242292,7.4874696506141625,67.713681714733639,74.847353903109806,0,114286,2651.8496358073699,-151.84963580736985,0,{"$f":"IF(AND(R54=1,S54>=SC_LT,V54<>0,OR(IF(AND($G$4=$J$4,B54=\"X\"),TRUE,FALSE),IF(AND($G$4=$J$3,A54=\"X\",D54<>$O$4),TRUE,FALSE))),MAX($W$25:W53)+1,0)","v":0}]
[null,"X",3396008112,66.674999999999997,6,811,134.16666666666666,127.16666666666666,360650.94611489022,33717.143154652455,2836.0493796714827,13.597891691765584,2,1.3131217206125847,7.4017222560025173,71.495366397965441,79.094870347833947,1,93750,2084.8206670720301,415.17933292796988,"Center",{"$f":"IF(AND(R55=1,S55>=SC_LT,V55<>0,OR(IF(AND($G$4=$J$4,B55=\"X\"),TRUE,FALSE),IF(AND($G$4=$J$3,A55=\"X\",D55<>$O$4),TRUE,FALSE))),MAX($W$25:W54)+1,0)","v":5}]
[null,"X",3396008612,66.674999999999997,6,861,142.5,135.5,360650.94611489022,33717.143154652455,2661.6305986338762,14.442481237837983,2,1.3991716367733045,7.4877721721632371,67.701160262838982,74.833290046048873,0,114286,2185.8532660659589,314.14673393404109,"Center",{"$f":"IF(AND(R56=1,S56>=SC_LT,V56<>0,OR(IF(AND($G$4=$J$4,B56=\"X\"),TRUE,FALSE),IF(AND($G$4=$J$3,A56=\"X\",D56<>$O$4),TRUE,FALSE))),MAX($W$25:W55)+1,0)","v":0}]
[null,"X",3396009112,66.674999999999997,6,911,150.83333333333334,143.83333333333334,360650.94611489022,33717.143154652455,2507.4225685855636,15.28707078391038,2,1.4852215529340242,7.5738220883239569,64.346607214053947,71.065519744470706,0,171429,2286.8858650598877,213.11413494011231,"Center",{"$f":"IF(AND(R57=1,S57>=SC_LT,V57<>0,OR(IF(AND($G$4=$J$4,B57=\"X\"),TRUE,FALSE),IF(AND($G$4=$J$3,A57=\"X\",D57<>$O$4),TRUE,FALSE))),MAX($W$25:W56)+1,0)","v":0}]
[null,"X",3396009612,66.674999999999997,6,961,159.16666666666666,152.16666666666666,360650.94611489022,33717.143154652455,2370.1047937451713,16.131660329982775,2,1.5712714690947442,7.6598720044846775,61.359475090656105,67.710429651170514,0,200000,2387.918464053816,112.08153594618398,"No cut",{"$f":"IF(AND(R58=1,S58>=SC_LT,V58<>0,OR(IF(AND($G$4=$J$4,B58=\"X\"),TRUE,FALSE),IF(AND($G$4=$J$3,A58=\"X\",D58<>$O$4),TRUE,FALSE))),MAX($W$25:W57)+1,0)","v":0}]
[null,"X",3296507632,50.8,6.5,763,116.38461538461539,108.38461538461539,630036.80336873792,42059.544271489729,5812.9726357655027,10.914813451339221,2,0.64064950491308337,6.7292500403030164,136.25364767294599,151.83014250502626,0,17500,1987.4802505239393,512.51974947606072,"Ex_Center",{"$f":"IF(AND(R59=1,S59>=SC_LT,V59<>0,OR(IF(AND($G$4=$J$4,B59=\"X\"),TRUE,FALSE),IF(AND($G$4=$J$3,A59=\"X\",D59<>$O$4),TRUE,FALSE))),MAX($W$25:W58)+1,0)","v":0}]
[null,"X",3296508382,50.8,6.5,838,127.92307692307693,119.92307692307693,630036.80336873792,42059.544271489729,5253.674434761765,11.996916569449523,2,0.70885207818275175,6.7974526135726849,124.08699536068136,138.16478959955316,0,26667,2138.366883976445,361.63311602355498,"Center",{"$f":"IF(AND(R60=1,S60>=SC_LT,V60<>0,OR(IF(AND($G$4=$J$4,B60=\"X\"),TRUE,FALSE),IF(AND($G$4=$J$3,A60=\"X\",D60<>$O$4),TRUE,FALSE))),MAX($W$25:W59)+1,0)","v":0}]
[null,"X",3296509132,50.8,6.5,913,139.46153846153845,131.46153846153845,630036.80336873792,42059.544271489729,4792.5561403122256,13.079019687559821,2,0.77705465145241981,6.8656551868423525,114.05609243032397,126.89826985478336,0,41500,2289.2535174289505,210.74648257104946,"Center",{"$f":"IF(AND(R61=1,S61>=SC_LT,V61<>0,OR(IF(AND($G$4=$J$4,B61=\"X\"),TRUE,FALSE),IF(AND($G$4=$J$3,A61=\"X\",D61<>$O$4),TRUE,FALSE))),MAX($W$25:W60)+1,0)","v":0}]
[null,"X",3296509892,50.8,6.5,989,151.15384615384616,143.15384615384616,630036.80336873792,42059.544271489729,4401.1168424468524,14.175550847244924,2,0.8461665923656837,6.9347671277556167,105.54094643139528,117.33421952027284,0,59375,2442.151972660823,57.848027339176952,"No cut",{"$f":"IF(AND(R62=1,S62>=SC_LT,V62<>0,OR(IF(AND($G$4=$J$4,B62=\"X\"),TRUE,FALSE),IF(AND($G$4=$J$3,A62=\"X\",D62<>$O$4),TRUE,FALSE))),MAX($W$25:W61)+1,0)","v":0}]
[null,"X",3296510642,50.8,6.5,1064,162.69230769230768,154.69230769230768,630036.80336873792,42059.544271489729,4072.8386095443034,15.257653965355221,2,0.91436916563535175,7.0029697010252843,98.39977001737843,109.313385740104,0,75000,2593.0386061133286,-93.038606113328569,0,{"$f":"IF(AND(R63=1,S63>=SC_LT,V63<>0,OR(IF(AND($G$4=$J$4,B63=\"X\"),TRUE,FALSE),IF(AND($G$4=$J$3,A63=\"X\",D63<>$O$4),TRUE,FALSE))),MAX($W$25:W62)+1,0)","v":0}]
[null,"X",3296511402,50.8,6.5,1140,174.38461538461539,166.38461538461539,630036.80336873792,42059.544271489729,3786.6289615319429,16.354185125040328,2,0.98348110654861576,7.0720816419385484,92.173729473116509,102.32041519590943,0,87500,2745.9370613452011,-245.93706134520107,0,{"$f":"IF(AND(R64=1,S64>=SC_LT,V64<>0,OR(IF(AND($G$4=$J$4,B64=\"X\"),TRUE,FALSE),IF(AND($G$4=$J$3,A64=\"X\",D64<>$O$4),TRUE,FALSE))),MAX($W$25:W63)+1,0)","v":0}]
[null,"X",3296512162,50.8,6.5,1216,186.07692307692307,178.07692307692307,630036.80336873792,42059.544271489729,3538.0036474270382,17.450716284725431,2,1.0525930474618794,7.1411935828518125,86.765276974407797,96.245744023393158,0,100000,2898.8355165770736,-398.83551657707358,0,{"$f":"IF(AND(R65=1,S65>=SC_LT,V65<>0,OR(IF(AND($G$4=$J$4,B65=\"X\"),TRUE,FALSE),IF(AND($G$4=$J$3,A65=\"X\",D65<>$O$4),TRUE,FALSE))),MAX($W$25:W64)+1,0)","v":0}]
[null,"X",3396510182,66.674999999999997,6.5,1018,155.61538461538461,148.61538461538461,493353.04179062089,42059.544271489729,3319.6633246780907,18.637230708062816,2,1.1218240155536243,7.2104245509435572,82.015626809492744,90.911027125493945,0,142857,2503.7355191622664,-3.7355191622664279,0,{"$f":"IF(AND(R66=1,S66>=SC_LT,V66<>0,OR(IF(AND($G$4=$J$4,B66=\"X\"),TRUE,FALSE),IF(AND($G$4=$J$3,A66=\"X\",D66<>$O$4),TRUE,FALSE))),MAX($W$25:W65)+1,0)","v":0}]
[null,"X",3396510772,66.674999999999997,6.5,1077,164.69230769230768,157.69230769230768,493353.04179062089,42059.544271489729,3128.5802650136939,19.724325727119375,2,1.190341217331744,7.2789417527216767,77.858915513929517,86.242287909302348,0,185714,2622.6262427853817,-122.62624278538169,0,{"$f":"IF(AND(R67=1,S67>=SC_LT,V67<>0,OR(IF(AND($G$4=$J$4,B67=\"X\"),TRUE,FALSE),IF(AND($G$4=$J$3,A67=\"X\",D67<>$O$4),TRUE,FALSE))),MAX($W$25:W66)+1,0)","v":0}]
[null,"X",3396511372,66.674999999999997,6.5,1137,173.92307692307693,166.92307692307693,493353.04179062089,42059.544271489729,2955.5712181004938,20.829846085481979,2,1.2600197276145781,7.348620263004511,74.095375926475853,82.015151691689809,1,212500,2743.5320634190584,-243.53206341905843,0,{"$f":"IF(AND(R68=1,S68>=SC_LT,V68<>0,OR(IF(AND($G$4=$J$4,B68=\"X\"),TRUE,FALSE),IF(AND($G$4=$J$3,A68=\"X\",D68<>$O$4),TRUE,FALSE))),MAX($W$25:W67)+1,0)","v":0}]
[null,"X",3397008372,{"$f":"INDEX($O$3:$O$4,MATCH(VALUE(LEFT(C69,3)),$Q$3:$Q$4,0))","v":66.674999999999997},{"$f":"VALUE(RIGHT(LEFT(C69,5),2))/10","v":7},{"$f":"VALUE(RIGHT(LEFT(C69,9),4))","v":837},{"$f":"(F69/E69)-1","v":118.57142857142857},{"$f":"G69-VLOOKUP(D69,$O$3:$P$4,2,0)","v":111.57142857142857},{"$f":"(($E69^4)*206000*PI())/(32*($D69+$E69))","v":659081.5134125523},{"$f":"((E69^3)*VLOOKUP(E69,$O$7:$P$13,2,0)*PI())/32","v":51857.877233725019},{"$f":"I69/H69","v":5907.2606835952192},{"$f":"((PI()*((E69/2)^2))*(PI()*(D69+E69)))*G69*(7.85/1000000)*M69","v":16.581953135098953},2,{"$f":"((SC_LMT/M69)+SC_SBD)/K69","v":0.63042385305907289},{"$f":"N69+SC_RDT","v":6.7190243884490055},{"$f":"((((O69+SC_TOL_MIN)*K69)-SC_SBD)*M69)/(SC_HMA*9.81)","v":138.30473579210602},{"$f":"((((O69+SC_TOL_PLUS)*K69)-SC_SBD)*M69)/(SC_HMA*9.81)","v":154.13388574262089},{"$f":"IF(AND(SC_W>=P69,SC_W<=Q69),1,0)","v":0},{"$f":"_xlfn.IFNA(VLOOKUP(ROUND(VLOOKUP(ROUND(1-(SC_RDT/O69),2),SC_LT_TABLE,2,0)-(($I69*O69)/($H69*J69)),2),SC_LT_TABLE,3,0),0)","v":44750},{"$f":"((F69+(O69*E69)+$K$9+$K$8+$K$11)*M69)+IF(M69=4,$K$10,0)","v":2142.0663414382861},{"$f":"SC_DW-T69","v":357.93365856171386},{"$f":"IF(U69>=$K$15,$J$15,IF(U69>=$K$14,$J$14,IF(AND(U69>=$K$13,M69=4),$J$14,IF(U69>=$K$13,$J$13,0))))","v":"Center"},{"$f":"IF(AND(R69=1,S69>=SC_LT,V69<>0,OR(IF(AND($G$4=$J$4,B69=\"X\"),TRUE,FALSE),IF(AND($G$4=$J$3,A69=\"X\",D69<>$O$4),TRUE,FALSE))),MAX($W$25:W68)+1,0)","v":0}]
[null,"X",3397009062,66.674999999999997,7,906,128.42857142857142,121.42857142857142,659081.5134125523,51857.877233725019,5427.7301104563139,17.960452853558984,2,0.68612071075571301,6.7747212461456456,127.87330271041252,142.41749813553267,0,65625,2280.846097446039,219.15390255396096,"Center",{"$f":"IF(AND(R70=1,S70>=SC_LT,V70<>0,OR(IF(AND($G$4=$J$4,B70=\"X\"),TRUE,FALSE),IF(AND($G$4=$J$3,A70=\"X\",D70<>$O$4),TRUE,FALSE))),MAX($W$25:W69)+1,0)","v":0}]
[null,"X",3397009752,66.674999999999997,7,975,138.28571428571428,131.28571428571428,659081.5134125523,51857.877233725019,5020.2073926962639,19.338952572019018,2,0.74181756845235325,6.8304181038422858,119.00828721878831,132.46048102874713,0,81250,2419.6258534537919,80.374146546208067,"No cut",{"$f":"IF(AND(R71=1,S71>=SC_LT,V71<>0,OR(IF(AND($G$4=$J$4,B71=\"X\"),TRUE,FALSE),IF(AND($G$4=$J$3,A71=\"X\",D71<>$O$4),TRUE,FALSE))),MAX($W$25:W70)+1,0)","v":0}]
[null,"X",3397010442,66.674999999999997,7,1044,148.14285714285714,141.14285714285714,659081.5134125523,51857.877233725019,4669.6058642589742,20.717452290479049,2,0.79751442614899359,6.8861149615389268,111.38150263591326,123.89422137209965,0,93750,2558.4056094615448,-58.405609461544827,0,{"$f":"IF(AND(R72=1,S72>=SC_LT,V72<>0,OR(IF(AND($G$4=$J$4,B72=\"X\"),TRUE,FALSE),IF(AND($G$4=$J$3,A72=\"X\",D72<>$O$4),TRUE,FALSE))),MAX($W$25:W71)+1,0)","v":0}]
[null,"X",3397011132,66.674999999999997,7,1113,158,151,659081.5134125523,51857.877233725019,4364.778234520214,22.095952008939086,2,0.85321128384563383,6.9418118192355669,104.7504571944164,116.44635701594159,0,128571,2697.1853654692977,-197.18536546929772,0,{"$f":"IF(AND(R73=1,S73>=SC_LT,V73<>0,OR(IF(AND($G$4=$J$4,B73=\"X\"),TRUE,FALSE),IF(AND($G$4=$J$3,A73=\"X\",D73<>$O$4),TRUE,FALSE))),MAX($W$25:W72)+1,0)","v":0}]
[null,"X",3397011832,66.674999999999997,7,1183,168,161,659081.5134125523,51857.877233725019,4093.6739963512564,23.494429984188393,2,0.9097153423784573,6.9983158777683903,98.853011073074327,109.82245748953585,0,171429,2837.9764222887575,-337.97642228875748,0,{"$f":"IF(AND(R74=1,S74>=SC_LT,V74<>0,OR(IF(AND($G$4=$J$4,B74=\"X\"),TRUE,FALSE),IF(AND($G$4=$J$3,A74=\"X\",D74<>$O$4),TRUE,FALSE))),MAX($W$25:W73)+1,0)","v":0}]
[null,"X",3397012522,66.674999999999997,7,1252,177.85714285714286,170.85714285714286,659081.5134125523,51857.877233725019,3857.5004965617609,24.872929702648428,2,0.96541220007509754,7.0540127354650304,93.715428201982107,104.05202194057085,0,212500,2976.7561782965104,-476.75617829651037,0,{"$f":"IF(AND(R75=1,S75>=SC_LT,V75<>0,OR(IF(AND($G$4=$J$4,B75=\"X\"),TRUE,FALSE),IF(AND($G$4=$J$3,A75=\"X\",D75<>$O$4),TRUE,FALSE))),MAX($W$25:W74)+1,0)","v":0}]
[null,"X",3295004482,50.8,5,448,88.6,80.599999999999994,226523.32781680438,20371.264863121316,2810.4631242779701,9.5758499370173134,4,0.83701116740059789,6.9256117027905306,132.07598070242469,147.13786627254419,0,15000,2794.5122340558105,-294.5122340558105,0,{"$f":"IF(AND(R76=1,S76>=SC_LT,V76<>0,OR(IF(AND($G$4=$J$4,B76=\"X\"),TRUE,FALSE),IF(AND($G$4=$J$3,A76=\"X\",D76<>$O$4),TRUE,FALSE))),MAX($W$25:W75)+1,0)","v":0}]
[null,"X",3295004902,50.8,5,490,97,89,226523.32781680438,20371.264863121316,2545.2059305258917,10.48371832833724,4,0.92424310047956848,7.0128436358695012,120.53547496177782,134.17578930954895,0,22500,2964.2568727173903,-464.25687271739025,0,{"$f":"IF(AND(R77=1,S77>=SC_LT,V77<>0,OR(IF(AND($G$4=$J$4,B77=\"X\"),TRUE,FALSE),IF(AND($G$4=$J$3,A77=\"X\",D77<>$O$4),TRUE,FALSE))),MAX($W$25:W76)+1,0)","v":0}]
[null,"X",3295005332,50.8,5,533,105.6,97.6,226523.32781680438,20371.264863121316,2320.935735827914,11.413202633736212,4,1.0135519843461334,7.102152519736066,110.77818456464331,123.21658596783627,0,33333,3138.0430503947214,-638.04305039472138,0,{"$f":"IF(AND(R78=1,S78>=SC_LT,V78<>0,OR(IF(AND($G$4=$J$4,B78=\"X\"),TRUE,FALSE),IF(AND($G$4=$J$3,A78=\"X\",D78<>$O$4),TRUE,FALSE))),MAX($W$25:W77)+1,0)","v":0}]
[null,"X",3295005762,50.8,5,576,114.2,106.2,226523.32781680438,20371.264863121316,2132.9880208738641,12.342686939135183,4,1.1028608682126986,7.1914614036026316,102.60117095499194,114.03231951385854,0,53125,3311.8292280720525,-811.8292280720525,0,{"$f":"IF(AND(R79=1,S79>=SC_LT,V79<>0,OR(IF(AND($G$4=$J$4,B79=\"X\"),TRUE,FALSE),IF(AND($G$4=$J$3,A79=\"X\",D79<>$O$4),TRUE,FALSE))),MAX($W$25:W78)+1,0)","v":0}]
[null,"X",3295006192,50.8,5,619,122.8,114.8,226523.32781680438,20371.264863121316,1973.1997196585748,13.272171244534155,4,1.1921697520792633,7.2807702874691964,95.649284819957359,106.22409298155694,0,65625,3485.6154057493841,-985.61540574938408,0,{"$f":"IF(AND(R80=1,S80>=SC_LT,V80<>0,OR(IF(AND($G$4=$J$4,B80=\"X\"),TRUE,FALSE),IF(AND($G$4=$J$3,A80=\"X\",D80<>$O$4),TRUE,FALSE))),MAX($W$25:W79)+1,0)","v":0}]
[null,"X",3295006632,50.8,5,663,131.6,123.6,226523.32781680438,20371.264863121316,1832.7130082265728,14.223271464012171,4,1.283555586733423,7.3721561221233554,89.53715011464584,99.359059313283637,0,81250,3663.443122442467,-1163.443122442467,0,{"$f":"IF(AND(R81=1,S81>=SC_LT,V81<>0,OR(IF(AND($G$4=$J$4,B81=\"X\"),TRUE,FALSE),IF(AND($G$4=$J$3,A81=\"X\",D81<>$O$4),TRUE,FALSE))),MAX($W$25:W80)+1,0)","v":0}]
[null,"X",3295305032,50.8,5.3,503,93.905660377358487,85.905660377358487,284451.17487941781,23970.183086284989,3311.2041002875344,11.465045265860823,4,0.71043310812038474,6.7990336435103176,153.8616447459666,171.60711054732067,0,16667,3020.1395132424186,-520.13951324241862,0,{"$f":"IF(AND(R82=1,S82>=SC_LT,V82<>0,OR(IF(AND($G$4=$J$4,B82=\"X\"),TRUE,FALSE),IF(AND($G$4=$J$3,A82=\"X\",D82<>$O$4),TRUE,FALSE))),MAX($W$25:W81)+1,0)","v":0}]
[null,"X",3295305512,50.8,5.3,551,102.9622641509434,94.962264150943398,284451.17487941781,23970.183086284989,2995.4127297057707,12.570775972634621,4,0.7853305146430698,6.8739310500330024,140.12255600158443,156.17562689241794,0,25000,3213.7273382606995,-713.72733826069953,0,{"$f":"IF(AND(R83=1,S83>=SC_LT,V83<>0,OR(IF(AND($G$4=$J$4,B83=\"X\"),TRUE,FALSE),IF(AND($G$4=$J$3,A83=\"X\",D83<>$O$4),TRUE,FALSE))),MAX($W$25:W82)+1,0)","v":0}]
[null,"X",3295306002,50.8,5.3,600,112.20754716981132,104.20754716981132,284451.17487941781,23970.183086284989,2729.6600160436619,13.699542735799541,4,0.86178828380164396,6.950388819191577,128.56049174904419,143.18933581813073,0,38250,3411.3482429668616,-911.34824296686156,0,{"$f":"IF(AND(R84=1,S84>=SC_LT,V84<>0,OR(IF(AND($G$4=$J$4,B84=\"X\"),TRUE,FALSE),IF(AND($G$4=$J$3,A84=\"X\",D84<>$O$4),TRUE,FALSE))),MAX($W$25:W83)+1,0)","v":0}]
[null,"X",3295306492,50.8,5.3,649,121.45283018867924,113.45283018867924,284451.17487941781,23970.183086284989,2507.2197353416173,14.82830949896446,4,0.93824605296021824,7.0268465883501507,118.88281515116705,132.31955318435598,0,59375,3608.9691476730231,-1108.9691476730231,0,{"$f":"IF(AND(R85=1,S85>=SC_LT,V85<>0,OR(IF(AND($G$4=$J$4,B85=\"X\"),TRUE,FALSE),IF(AND($G$4=$J$3,A85=\"X\",D85<>$O$4),TRUE,FALSE))),MAX($W$25:W84)+1,0)","v":0}]
[null,"X",3295306972,50.8,5.3,697,130.50943396226415,122.50943396226415,284451.17487941781,23970.183086284989,2321.8715953502456,15.93404020573826,4,1.0131434594829032,7.1017439948728356,110.81890086732726,123.2623177460528,0,71875,3802.5569726913041,-1302.5569726913041,0,{"$f":"IF(AND(R86=1,S86>=SC_LT,V86<>0,OR(IF(AND($G$4=$J$4,B86=\"X\"),TRUE,FALSE),IF(AND($G$4=$J$3,A86=\"X\",D86<>$O$4),TRUE,FALSE))),MAX($W$25:W85)+1,0)","v":0}]
[null,"X",3295307462,50.8,5.3,746,139.75471698113208,131.75471698113208,284451.17487941781,23970.183086284989,2158.9449045695465,17.062806968903178,4,1.0896012286414776,7.1782017640314102,103.73047327875588,115.30073044524093,0,84375,4000.1778773974661,-1500.1778773974661,0,{"$f":"IF(AND(R87=1,S87>=SC_LT,V87<>0,OR(IF(AND($G$4=$J$4,B87=\"X\"),TRUE,FALSE),IF(AND($G$4=$J$3,A87=\"X\",D87<>$O$4),TRUE,FALSE))),MAX($W$25:W86)+1,0)","v":0}]
[null,"X",3295307952,50.8,5.3,795,149,141,284451.17487941781,23970.183086284989,2017.3842190029632,18.1915737320681,4,1.1660589978000517,7.2546595331899848,97.571613338625568,108.38321588025076,0,96875,4197.7987821036277,-1697.7987821036277,0,{"$f":"IF(AND(R88=1,S88>=SC_LT,V88<>0,OR(IF(AND($G$4=$J$4,B88=\"X\"),TRUE,FALSE),IF(AND($G$4=$J$3,A88=\"X\",D88<>$O$4),TRUE,FALSE))),MAX($W$25:W87)+1,0)","v":0}]
[null,"X",3295505412,50.8,5.5,541,97.36363636363636,89.36363636363636,328707.39746922464,26624.138709932282,3678.3126878550065,12.84694786378402,4,0.6395293767045187,6.7281299120944515,169.83338410705971,189.54626499028575,0,17500,3176.0188580660779,-676.01885806607788,0,{"$f":"IF(AND(R89=1,S89>=SC_LT,V89<>0,OR(IF(AND($G$4=$J$4,B89=\"X\"),TRUE,FALSE),IF(AND($G$4=$J$3,A89=\"X\",D89<>$O$4),TRUE,FALSE))),MAX($W$25:W88)+1,0)","v":0}]
[null,"X",3295505932,50.8,5.5,593,106.81818181818181,98.818181818181813,328707.39746922464,26624.138709932282,3326.3858069562752,14.094457273525885,4,0.70719067393470181,6.7957912093246344,154.52215302657211,172.34898090901109,0,26667,3385.507406605142,-885.50740660514202,0,{"$f":"IF(AND(R90=1,S90>=SC_LT,V90<>0,OR(IF(AND($G$4=$J$4,B90=\"X\"),TRUE,FALSE),IF(AND($G$4=$J$3,A90=\"X\",D90<>$O$4),TRUE,FALSE))),MAX($W$25:W89)+1,0)","v":0}]
[null,"X",3295506462,50.8,5.5,646,116.45454545454545,108.45454545454545,328707.39746922464,26624.138709932282,3030.8309909148961,15.365957248839711,4,0.77615314995777307,6.864753685347706,141.6634930861774,157.90637817269138,0,41500,3599.0245810776496,-1099.0245810776496,0,{"$f":"IF(AND(R91=1,S91>=SC_LT,V91<>0,OR(IF(AND($G$4=$J$4,B91=\"X\"),TRUE,FALSE),IF(AND($G$4=$J$3,A91=\"X\",D91<>$O$4),TRUE,FALSE))),MAX($W$25:W90)+1,0)","v":0}]
[null,"X",3295506982,50.8,5.5,698,125.90909090909091,117.90909090909091,328707.39746922464,26624.138709932282,2787.8036793843262,16.613466658581576,4,0.84381444718795617,6.9324149825778889,131.09013956395819,146.03058822102156,0,59375,3808.5131296167137,-1308.5131296167137,0,{"$f":"IF(AND(R92=1,S92>=SC_LT,V92<>0,OR(IF(AND($G$4=$J$4,B92=\"X\"),TRUE,FALSE),IF(AND($G$4=$J$3,A92=\"X\",D92<>$O$4),TRUE,FALSE))),MAX($W$25:W91)+1,0)","v":0}]
[null,"X",3295507512,50.8,5.5,751,135.54545454545453,127.54545454545453,328707.39746922464,26624.138709932282,2577.1784548549331,17.884966633895399,4,0.91277692321102732,7.0013774586009605,121.92649887838887,135.73816096549589,0,75000,4022.0303040892213,-1522.0303040892213,0,{"$f":"IF(AND(R93=1,S93>=SC_LT,V93<>0,OR(IF(AND($G$4=$J$4,B93=\"X\"),TRUE,FALSE),IF(AND($G$4=$J$3,A93=\"X\",D93<>$O$4),TRUE,FALSE))),MAX($W$25:W92)+1,0)","v":0}]
[null,"X",3295508042,50.8,5.5,804,145.18181818181819,137.18181818181819,328707.39746922464,26624.138709932282,2396.1440504714851,19.156466609209229,4,0.98173939923409859,7.0703399346240312,114.05026165560329,126.8917208393085,0,87500,4235.5474785617289,-1735.5474785617289,0,{"$f":"IF(AND(R94=1,S94>=SC_LT,V94<>0,OR(IF(AND($G$4=$J$4,B94=\"X\"),TRUE,FALSE),IF(AND($G$4=$J$3,A94=\"X\",D94<>$O$4),TRUE,FALSE))),MAX($W$25:W93)+1,0)","v":0}]
[null,"X",3295508572,50.8,5.5,857,154.81818181818181,146.81818181818181,328707.39746922464,26624.138709932282,2238.8739146510657,20.427966584523048,4,1.0507018752571697,7.1393024106471028,107.20793297227934,119.20654715693021,0,100000,4449.0646530342365,-1949.0646530342365,0,{"$f":"IF(AND(R95=1,S95>=SC_LT,V95<>0,OR(IF(AND($G$4=$J$4,B95=\"X\"),TRUE,FALSE),IF(AND($G$4=$J$3,A95=\"X\",D95<>$O$4),TRUE,FALSE))),MAX($W$25:W94)+1,0)","v":0}]
[null,"X",3296006482,50.8,6,648,107,99,461449.07586090924,33717.143154652455,4661.1017763728205,16.951339278297944,4,0.50468518677547936,6.5932857221654118,212.59144452929877,237.57130673775399,0,19167,3614.2388573319699,-1114.2388573319699,0,{"$f":"IF(AND(R96=1,S96>=SC_LT,V96<>0,OR(IF(AND($G$4=$J$4,B96=\"X\"),TRUE,FALSE),IF(AND($G$4=$J$3,A96=\"X\",D96<>$O$4),TRUE,FALSE))),MAX($W$25:W95)+1,0)","v":0}]
[null,"X",3296007112,50.8,6,711,117.5,109.5,461449.07586090924,33717.143154652455,4214.1468115151529,18.614788459813166,4,0.55821240355469681,6.6468129389446293,193.1458405673888,215.73037352297843,0,30000,3867.523510534671,-1367.523510534671,0,{"$f":"IF(AND(R97=1,S97>=SC_LT,V97<>0,OR(IF(AND($G$4=$J$4,B97=\"X\"),TRUE,FALSE),IF(AND($G$4=$J$3,A97=\"X\",D97<>$O$4),TRUE,FALSE))),MAX($W$25:W96)+1,0)","v":0}]
[null,"X",3296007752,50.8,6,775,128.16666666666666,120.16666666666666,461449.07586090924,33717.143154652455,3840.0755272752508,20.304641596590532,4,0.61258925869548908,6.7011897940854217,176.87117618555652,197.45097944744614,0,50000,4124.8285550580495,-1624.8285550580495,0,{"$f":"IF(AND(R98=1,S98>=SC_LT,V98<>0,OR(IF(AND($G$4=$J$4,B98=\"X\"),TRUE,FALSE),IF(AND($G$4=$J$3,A98=\"X\",D98<>$O$4),TRUE,FALSE))),MAX($W$25:W97)+1,0)","v":0}]
[null,"X",3296008382,50.8,6,838,138.66666666666666,130.66666666666666,461449.07586090924,33717.143154652455,3531.4980295477749,21.968090778105747,4,0.66611647547470665,6.7547170108646393,163.44594034713933,182.37200941834135,0,65625,4378.113208260751,-1878.113208260751,0,{"$f":"IF(AND(R99=1,S99>=SC_LT,V99<>0,OR(IF(AND($G$4=$J$4,B99=\"X\"),TRUE,FALSE),IF(AND($G$4=$J$3,A99=\"X\",D99<>$O$4),TRUE,FALSE))),MAX($W$25:W98)+1,0)","v":0}]
[null,"X",3296009022,50.8,6,902,149.33333333333334,141.33333333333334,461449.07586090924,33717.143154652455,3264.9698763743577,23.657943914883116,4,0.72049333061549914,6.8090938660054317,151.85013916175589,169.34782566154647,0,81250,4635.4182527841303,-2135.4182527841303,0,{"$f":"IF(AND(R100=1,S100>=SC_LT,V100<>0,OR(IF(AND($G$4=$J$4,B100=\"X\"),TRUE,FALSE),IF(AND($G$4=$J$3,A100=\"X\",D100<>$O$4),TRUE,FALSE))),MAX($W$25:W99)+1,0)","v":0}]
[null,"X",3296009662,50.8,6,966,160,152,461449.07586090924,33717.143154652455,3035.8491832954555,25.347797051660478,4,0.77487018575629141,6.863470721146224,141.88181884449648,158.15159751974033,0,93750,4892.7232973075097,-2392.7232973075097,0,{"$f":"IF(AND(R101=1,S101>=SC_LT,V101<>0,OR(IF(AND($G$4=$J$4,B101=\"X\"),TRUE,FALSE),IF(AND($G$4=$J$3,A101=\"X\",D101<>$O$4),TRUE,FALSE))),MAX($W$25:W100)+1,0)","v":0}]
[null,"X",3296010302,50.8,6,1030,170.66666666666666,162.66666666666666,461449.07586090924,33717.143154652455,2836.777105702311,27.037650188437844,4,0.82924704089708379,6.9178475762870164,133.22081922458258,148.42372716702354,0,128571,5150.0283418308882,-2650.0283418308882,0,{"$f":"IF(AND(R102=1,S102>=SC_LT,V102<>0,OR(IF(AND($G$4=$J$4,B102=\"X\"),TRUE,FALSE),IF(AND($G$4=$J$3,A102=\"X\",D102<>$O$4),TRUE,FALSE))),MAX($W$25:W101)+1,0)","v":0}]
[null,"X",3296010942,50.8,6,1094,181.33333333333334,173.33333333333334,461449.07586090924,33717.143154652455,2662.2062068898608,28.727503325215213,4,0.88362389603787628,6.9722244314278088,125.62578878865806,139.89313316541035,0,171429,5407.3333863542675,-2907.3333863542675,0,{"$f":"IF(AND(R103=1,S103>=SC_LT,V103<>0,OR(IF(AND($G$4=$J$4,B103=\"X\"),TRUE,FALSE),IF(AND($G$4=$J$3,A103=\"X\",D103<>$O$4),TRUE,FALSE))),MAX($W$25:W102)+1,0)","v":0}]
[null,"X",3396008112,66.674999999999997,6,811,134.16666666666666,127.16666666666666,360650.94611489022,33717.143154652455,2836.0493796714827,27.195783383531168,4,0.82945982444802402,6.9180603598379573,133.18915815512167,148.38816605485866,0,128571,4274.0334486361107,-1774.0334486361107,0,{"$f":"IF(AND(R104=1,S104>=SC_LT,V104<>0,OR(IF(AND($G$4=$J$4,B104=\"X\"),TRUE,FALSE),IF(AND($G$4=$J$3,A104=\"X\",D104<>$O$4),TRUE,FALSE))),MAX($W$25:W103)+1,0)","v":0}]
[null,"X",3396008612,66.674999999999997,6,861,142.5,135.5,360650.94611489022,33717.143154652455,2661.6305986338762,28.884962475675966,4,0.88381498987712126,6.9724155252670545,125.60074588486876,139.86500545128857,0,171429,4475.3379726064095,-1975.3379726064095,0,{"$f":"IF(AND(R105=1,S105>=SC_LT,V105<>0,OR(IF(AND($G$4=$J$4,B105=\"X\"),TRUE,FALSE),IF(AND($G$4=$J$3,A105=\"X\",D105<>$O$4),TRUE,FALSE))),MAX($W$25:W104)+1,0)","v":0}]
[null,"X",3396009112,66.674999999999997,6,911,150.83333333333334,143.83333333333334,360650.94611489022,33717.143154652455,2507.4225685855636,30.57414156782076,4,0.93817015530621839,7.0267706906961509,118.89163978729866,132.32946484813215,0,212500,4676.6424965767073,-2176.6424965767073,0,{"$f":"IF(AND(R106=1,S106>=SC_LT,V106<>0,OR(IF(AND($G$4=$J$4,B106=\"X\"),TRUE,FALSE),IF(AND($G$4=$J$3,A106=\"X\",D106<>$O$4),TRUE,FALSE))),MAX($W$25:W105)+1,0)","v":0}]
[null,"X",3396009612,66.674999999999997,6,961,159.16666666666666,152.16666666666666,360650.94611489022,33717.143154652455,2370.1047937451713,32.263320659965551,4,0.99252532073531563,7.0811258561252481,112.91737554050297,125.61928466153178,0,237500,4877.9470205470061,-2377.9470205470061,0,{"$f":"IF(AND(R107=1,S107>=SC_LT,V107<>0,OR(IF(AND($G$4=$J$4,B107=\"X\"),TRUE,FALSE),IF(AND($G$4=$J$3,A107=\"X\",D107<>$O$4),TRUE,FALSE))),MAX($W$25:W106)+1,0)","v":0}]
[null,"X",3296507632,50.8,6.5,763,116.38461538461539,108.38461538461539,630036.80336873792,42059.544271489729,5812.9726357655027,21.829626902678442,4,0.40467918360989363,6.4932797189998261,262.70572070508274,293.85871036924328,0,20000,4084.8252726939954,-1584.8252726939954,0,{"$f":"IF(AND(R108=1,S108>=SC_LT,V108<>0,OR(IF(AND($G$4=$J$4,B108=\"X\"),TRUE,FALSE),IF(AND($G$4=$J$3,A108=\"X\",D108<>$O$4),TRUE,FALSE))),MAX($W$25:W107)+1,0)","v":0}]
[null,"X",3296508382,50.8,6.5,838,127.92307692307693,119.92307692307693,630036.80336873792,42059.544271489729,5253.674434761765,23.993833138899046,4,0.44776071486715707,6.53636125025709,238.37241608055348,266.52800455829708,0,31667,4385.9453925066846,-1885.9453925066846,0,{"$f":"IF(AND(R109=1,S109>=SC_LT,V109<>0,OR(IF(AND($G$4=$J$4,B109=\"X\"),TRUE,FALSE),IF(AND($G$4=$J$3,A109=\"X\",D109<>$O$4),TRUE,FALSE))),MAX($W$25:W108)+1,0)","v":0}]
[null,"X",3296509132,50.8,6.5,913,139.46153846153845,131.46153846153845,630036.80336873792,42059.544271489729,4792.5561403122256,26.158039375119643,4,0.49084224612442034,6.579442781514353,218.31061021983868,243.99496506875752,0,53125,4687.0655123193737,-2187.0655123193737,0,{"$f":"IF(AND(R110=1,S110>=SC_LT,V110<>0,OR(IF(AND($G$4=$J$4,B110=\"X\"),TRUE,FALSE),IF(AND($G$4=$J$3,A110=\"X\",D110<>$O$4),TRUE,FALSE))),MAX($W$25:W109)+1,0)","v":0}]
[null,"X",3296509892,50.8,6.5,989,151.15384615384616,143.15384615384616,630036.80336873792,42059.544271489729,4401.1168424468524,28.351101694489849,4,0.53449819779844721,6.6230987331883799,201.28031822198133,224.86686439973641,0,71875,4992.2005670628978,-2492.2005670628978,0,{"$f":"IF(AND(R111=1,S111>=SC_LT,V111<>0,OR(IF(AND($G$4=$J$4,B111=\"X\"),TRUE,FALSE),IF(AND($G$4=$J$3,A111=\"X\",D111<>$O$4),TRUE,FALSE))),MAX($W$25:W110)+1,0)","v":0}]
[null,"X",3296510642,{"$f":"INDEX($O$3:$O$4,MATCH(VALUE(LEFT(C112,3)),$Q$3:$Q$4,0))","v":50.8},{"$f":"VALUE(RIGHT(LEFT(C112,5),2))/10","v":6.5},{"$f":"VALUE(RIGHT(LEFT(C112,9),4))","v":1064},{"$f":"(F112/E112)-1","v":162.69230769230768},{"$f":"G112-VLOOKUP(D112,$O$3:$P$4,2,0)","v":154.69230769230768},{"$f":"(($E112^4)*206000*PI())/(32*($D112+$E112))","v":630036.80336873792},{"$f":"((E112^3)*VLOOKUP(E112,$O$7:$P$13,2,0)*PI())/32","v":42059.544271489729},{"$f":"I112/H112","v":4072.8386095443034},{"$f":"((PI()*((E112/2)^2))*(PI()*(D112+E112)))*G112*(7.85/1000000)*M112","v":30.515307930710442},4,{"$f":"((SC_LMT/M112)+SC_SBD)/K112","v":0.57757972905571042},{"$f":"N112+SC_RDT","v":6.6661802644456429},{"$f":"((((O112+SC_TOL_MIN)*K112)-SC_SBD)*M112)/(SC_HMA*9.81)","v":186.99796539394765},{"$f":"((((O112+SC_TOL_PLUS)*K112)-SC_SBD)*M112)/(SC_HMA*9.81)","v":208.82519683939879},{"$f":"IF(AND(SC_W>=P112,SC_W<=Q112),1,0)","v":0},{"$f":"_xlfn.IFNA(VLOOKUP(ROUND(VLOOKUP(ROUND(1-(SC_RDT/O112),2),SC_LT_TABLE,2,0)-(($I112*O112)/($H112*J112)),2),SC_LT_TABLE,3,0),0)","v":84375},{"$f":"((F112+(O112*E112)+$K$9+$K$8+$K$11)*M112)+IF(M112=4,$K$10,0)","v":5293.3206868755869},{"$f":"SC_DW-T112","v":-2793.3206868755869},0,{"$f":"IF(AND(R112=1,S112>=SC_LT,V112<>0,OR(IF(AND($G$4=$J$4,B112=\"X\"),TRUE,FALSE),IF(AND($G$4=$J$3,A112=\"X\",D112<>$O$4),TRUE,FALSE))),MAX($W$25:W111)+1,0)","v":0}]
[null,"X",3296511402,50.8,6.5,1140,174.38461538461539,166.38461538461539,630036.80336873792,42059.544271489729,3786.6289615319429,32.708370250080655,4,0.62123568072973745,6.7098362161196707,174.54588430542381,194.83925575100966,0,100000,5598.455741619111,-3098.455741619111,{"$f":"IF(U113>=$K$15,$J$15,IF(U113>=$K$14,$J$14,IF(AND(U113>=$K$13,M113=4),$J$14,IF(U113>=$K$13,$J$13,0))))","v":0},{"$f":"IF(AND(R113=1,S113>=SC_LT,V113<>0,OR(IF(AND($G$4=$J$4,B113=\"X\"),TRUE,FALSE),IF(AND($G$4=$J$3,A113=\"X\",D113<>$O$4),TRUE,FALSE))),MAX($W$25:W112)+1,0)","v":0}]
[null,"X",3296512162,50.8,6.5,1216,186.07692307692307,178.07692307692307,630036.80336873792,42059.544271489729,3538.0036474270382,34.901432569450861,4,0.66489163240376425,6.7534921677936968,163.72897930800633,182.68991340597708,0,142857,5903.590796362636,-3403.590796362636,0,{"$f":"IF(AND(R114=1,S114>=SC_LT,V114<>0,OR(IF(AND($G$4=$J$4,B114=\"X\"),TRUE,FALSE),IF(AND($G$4=$J$3,A114=\"X\",D114<>$O$4),TRUE,FALSE))),MAX($W$25:W113)+1,0)","v":0}]
[null,"X",3396510182,66.674999999999997,6.5,1018,155.61538461538461,148.61538461538461,493353.04179062089,42059.544271489729,3319.6633246780907,37.274461416125632,4,0.70862276999621565,6.7972233053861482,154.22967897817628,172.02047961017865,0,185714,5112.7278059400396,-2612.7278059400396,0,{"$f":"IF(AND(R115=1,S115>=SC_LT,V115<>0,OR(IF(AND($G$4=$J$4,B115=\"X\"),TRUE,FALSE),IF(AND($G$4=$J$3,A115=\"X\",D115<>$O$4),TRUE,FALSE))),MAX($W$25:W114)+1,0)","v":0}]
[null,"X",3396510772,66.674999999999997,6.5,1077,164.69230769230768,157.69230769230768,493353.04179062089,42059.544271489729,3128.5802650136939,39.44865145423875,4,0.7519030426978478,6.8405035780877803,145.9162563870498,162.68300117779546,0,225000,5349.8530930302823,-2849.8530930302823,0,{"$f":"IF(AND(R116=1,S116>=SC_LT,V116<>0,OR(IF(AND($G$4=$J$4,B116=\"X\"),TRUE,FALSE),IF(AND($G$4=$J$3,A116=\"X\",D116<>$O$4),TRUE,FALSE))),MAX($W$25:W115)+1,0)","v":0}]
[null,"X",3396511372,66.674999999999997,6.5,1137,173.92307692307693,166.92307692307693,493353.04179062089,42059.544271489729,2955.5712181004938,41.659692170963957,4,0.79591687934357558,6.8845174147335086,138.3891772121425,154.22872874257041,0,262500,5590.9974527830709,-3090.9974527830709,0,{"$f":"IF(AND(R117=1,S117>=SC_LT,V117<>0,OR(IF(AND($G$4=$J$4,B117=\"X\"),TRUE,FALSE),IF(AND($G$4=$J$3,A117=\"X\",D117<>$O$4),TRUE,FALSE))),MAX($W$25:W116)+1,0)","v":0}]
[null,"X",3397008372,66.674999999999997,7,837,118.57142857142857,111.57142857142857,659081.5134125523,51857.877233725019,5907.2606835952192,33.163906270197906,4,0.39821994433408808,6.4868204797240212,266.8078969434028,298.4661968444326,0,56250,4393.6309734322731,-1893.6309734322731,0,{"$f":"IF(AND(R118=1,S118>=SC_LT,V118<>0,OR(IF(AND($G$4=$J$4,B118=\"X\"),TRUE,FALSE),IF(AND($G$4=$J$3,A118=\"X\",D118<>$O$4),TRUE,FALSE))),MAX($W$25:W117)+1,0)","v":0}]
[null,"X",3397009062,66.674999999999997,7,906,128.42857142857142,121.42857142857142,659081.5134125523,51857.877233725019,5427.7301104563139,35.920905707117967,4,0.43340198807167069,6.5220025234616035,245.9450307800158,275.0334216302561,0,75000,4670.6160706569244,-2170.6160706569244,0,{"$f":"IF(AND(R119=1,S119>=SC_LT,V119<>0,OR(IF(AND($G$4=$J$4,B119=\"X\"),TRUE,FALSE),IF(AND($G$4=$J$3,A119=\"X\",D119<>$O$4),TRUE,FALSE))),MAX($W$25:W118)+1,0)","v":0}]
[null,"X",3397009752,66.674999999999997,7,975,138.28571428571428,131.28571428571428,659081.5134125523,51857.877233725019,5020.2073926962639,38.677905144038036,4,0.4685840318092534,6.5571845671991866,228.21499979676742,255.11938741668504,0,90625,4947.6011678815776,-2447.6011678815776,0,{"$f":"IF(AND(R120=1,S120>=SC_LT,V120<>0,OR(IF(AND($G$4=$J$4,B120=\"X\"),TRUE,FALSE),IF(AND($G$4=$J$3,A120=\"X\",D120<>$O$4),TRUE,FALSE))),MAX($W$25:W119)+1,0)","v":0}]
[null,"X",3397010442,66.674999999999997,7,1044,148.14285714285714,141.14285714285714,659081.5134125523,51857.877233725019,4669.6058642589742,41.434904580958097,4,0.50376607554683617,6.5923666109367689,212.96143063101727,237.98686810339004,0,114286,5224.5862651062298,-2724.5862651062298,0,{"$f":"IF(AND(R121=1,S121>=SC_LT,V121<>0,OR(IF(AND($G$4=$J$4,B121=\"X\"),TRUE,FALSE),IF(AND($G$4=$J$3,A121=\"X\",D121<>$O$4),TRUE,FALSE))),MAX($W$25:W120)+1,0)","v":0}]
[null,"X",3397011132,66.674999999999997,7,1113,158,151,659081.5134125523,51857.877233725019,4364.778234520214,44.191904017878173,4,0.53894811928441888,6.6275486546743521,199.69933974802356,223.09113939107397,0,157143,5501.571362330882,-3001.571362330882,0,{"$f":"IF(AND(R122=1,S122>=SC_LT,V122<>0,OR(IF(AND($G$4=$J$4,B122=\"X\"),TRUE,FALSE),IF(AND($G$4=$J$3,A122=\"X\",D122<>$O$4),TRUE,FALSE))),MAX($W$25:W121)+1,0)","v":0}]
[null,"X",3397011832,66.674999999999997,7,1183,168,161,659081.5134125523,51857.877233725019,4093.6739963512564,46.988859968376786,4,0.57464004771385058,6.6632405831037831,187.90444750533942,209.84334033826246,0,200000,5782.5707363269057,-3282.5707363269057,0,{"$f":"IF(AND(R123=1,S123>=SC_LT,V123<>0,OR(IF(AND($G$4=$J$4,B123=\"X\"),TRUE,FALSE),IF(AND($G$4=$J$3,A123=\"X\",D123<>$O$4),TRUE,FALSE))),MAX($W$25:W122)+1,0)","v":0}]
[null,"X",3397012522,66.674999999999997,7,1252,177.85714285714286,170.85714285714286,659081.5134125523,51857.877233725019,3857.5004965617609,49.745859405296855,4,0.60982209145143329,6.6984226268413662,177.62928176315501,198.30246924033247,0,237500,6059.555833551558,-3559.555833551558,0,{"$f":"IF(AND(R124=1,S124>=SC_LT,V124<>0,OR(IF(AND($G$4=$J$4,B124=\"X\"),TRUE,FALSE),IF(AND($G$4=$J$3,A124=\"X\",D124<>$O$4),TRUE,FALSE))),MAX($W$25:W123)+1,0)","v":0}]
[null,null,{"$f":"ROUND(D125,0)&\"x\"&E125&\"-\"&ROUND(F125,0)","v":"51x5-423"},50.8,5,{"$f":"(G125+1)*E125","v":422.89705327511177},{"$f":"H125+VLOOKUP(D125,$O$3:$P$4,2,0)","v":83.579410655022357},{"$f":"I125/K125","v":75.579410655022357},{"$f":"(($E125^4)*206000*PI())/(32*($D125+$E125))","v":226523.32781680438},{"$f":"((E125^3)*VLOOKUP(E125,$O$7:$P$13,2,0)*PI())/32","v":20371.264863121316},{"$f":"(SC_HMT-SC_LMT)/(M125*SC_RDT)","v":2997.1565781421132},{"$f":"((PI()*((E125/2)^2))*(PI()*(D125+E125)))*G125*(7.85/1000000)*M125","v":4.5166133987406321},2,{"$f":"((SC_LMT/M125)+SC_SBD)/K125","v":1.2425370327115055},{"$f":"N125+SC_RDT","v":7.3311375681014379},{"$f":"((((O125+SC_TOL_MIN)*K125)-SC_SBD)*M125)/(SC_HMA*9.81)","v":74.999999999999986},{"$f":"((((O125+SC_TOL_PLUS)*K125)-SC_SBD)*M125)/(SC_HMA*9.81)","v":83.031208277693537},{"$f":"IF(AND(SC_W>=P125,SC_W<=Q125),1,0)","v":1},{"$f":"_xlfn.IFNA(VLOOKUP(ROUND(VLOOKUP(ROUND(1-(SC_RDT/O125),2),SC_LT_TABLE,2,0)-(($I125*O125)/($H125*J125)),2),SC_LT_TABLE,3,0),0)","v":0},{"$f":"((F125+(O125*E125)+$K$9+$K$8+$K$11)*M125)+IF(M125=4,$K$10,0)","v":1293.1054822312381},{"$f":"SC_DW-T125","v":1206.8945177687619},{"$f":"IF(U125>=$K$15,$J$15,IF(U125>=$K$14,$J$14,IF(AND(U125>=$K$13,M125=4),$J$14,IF(U125>=$K$13,$J$13,0))))","v":"Ex_Center"},{"$f":"IF(AND(R125=1,S125>=SC_LT,V125<>0,OR(IF(AND($G$4=$J$4,B125=\"X\"),TRUE,FALSE),IF(AND($G$4=$J$3,A125=\"X\",D125<>$O$4),TRUE,FALSE))),MAX($W$25:W124)+1,0)","v":0}]
[null,null,"51x5,5-653",50.8,5.5,652.70194789469974,117.67308143539995,109.67308143539995,328707.39746922464,26624.138709932282,2997.1565781421132,7.7633703846336788,2,1.2425370327115055,7.3311375681014379,74.999999999999986,83.031208277693537,1,30000,1760.0464090385153,739.95359096148468,"Ex_Center",{"$f":"IF(AND(R126=1,S126>=SC_LT,V126<>0,OR(IF(AND($G$4=$J$4,B126=\"X\"),TRUE,FALSE),IF(AND($G$4=$J$3,A126=\"X\",D126<>$O$4),TRUE,FALSE))),MAX($W$25:W125)+1,0)","v":0}]
[null,null,"51x6-978",50.8,6,977.7737111758513,161.96228519597523,153.96228519597523,461449.07586090924,33717.143154652455,2997.1565781421132,12.829334797408546,2,1.2425370327115055,7.3311375681014379,74.999999999999986,83.031208277693537,1,84375,2417.5210731689199,82.478926831080116,"No cut",{"$f":"IF(AND(R127=1,S127>=SC_LT,V127<>0,OR(IF(AND($G$4=$J$4,B127=\"X\"),TRUE,FALSE),IF(AND($G$4=$J$3,A127=\"X\",D127<>$O$4),TRUE,FALSE))),MAX($W$25:W126)+1,0)","v":0}]
[null,null,"67x6-770",66.674999999999997,6,769.98619600671987,127.33103266778663,120.33103266778663,360650.94611489022,33717.143154652455,2997.1565781421132,12.905095089817848,2,1.2425370327115055,7.3311375681014379,74.999999999999986,83.031208277693537,1,84375,2001.946042830657,498.05395716934299,"Ex_Center",{"$f":"IF(AND(R128=1,S128>=SC_LT,V128<>0,OR(IF(AND($G$4=$J$4,B128=\"X\"),TRUE,FALSE),IF(AND($G$4=$J$3,A128=\"X\",D128<>$O$4),TRUE,FALSE))),MAX($W$25:W127)+1,0)","v":0}]
[null,null,"51x6,5-1425",50.8,6.5,1424.8748006236517,218.21150778825412,210.21150778825412,630036.80336873792,42059.544271489729,2997.1565781421132,20.464370592052376,2,1.2425370327115055,7.3311375681014379,74.999999999999986,83.031208277693537,1,212500,3319.0543896326221,-819.05438963262213,0,{"$f":"IF(AND(R129=1,S129>=SC_LT,V129<>0,OR(IF(AND($G$4=$J$4,B129=\"X\"),TRUE,FALSE),IF(AND($G$4=$J$3,A129=\"X\",D129<>$O$4),TRUE,FALSE))),MAX($W$25:W128)+1,0)","v":0}]
[null,null,"67x6,5-1122",66.674999999999997,6.5,1121.9456928696309,171.60702967225092,164.60702967225092,493353.04179062089,42059.544271489729,2997.1565781421132,20.552465368587537,2,1.2425370327115055,7.3311375681014379,74.999999999999986,83.031208277693537,1,212500,2713.1961741245805,-213.19617412458047,0,{"$f":"IF(AND(R130=1,S130>=SC_LT,V130<>0,OR(IF(AND($G$4=$J$4,B130=\"X\"),TRUE,FALSE),IF(AND($G$4=$J$3,A130=\"X\",D130<>$O$4),TRUE,FALSE))),MAX($W$25:W129)+1,0)","v":0}]
[null,null,"67x7-1595",66.674999999999997,7,1595.3158393972667,226.9022627710381,219.9022627710381,659081.5134125523,51857.877233725019,2997.1565781421132,31.731781701952809,2,1.2425370327115055,7.3311375681014379,74.999999999999986,83.031208277693537,1,330000,3667.2676047479536,-1167.2676047479536,0,{"$f":"IF(AND(R131=1,S131>=SC_LT,V131<>0,OR(IF(AND($G$4=$J$4,B131=\"X\"),TRUE,FALSE),IF(AND($G$4=$J$3,A131=\"X\",D131<>$O$4),TRUE,FALSE))),MAX($W$25:W130)+1,0)","v":0}]
[null,null,"67x7,5-2219",66.674999999999997,7.5,2218.7703505976365,294.83604674635154,287.83604674635154,862689.70093224838,62540.39672209759,2997.1565781421132,47.654077595882512,2,1.2425370327115055,7.3311375681014379,74.999999999999986,83.031208277693537,1,400000,4921.5077647167946,-2421.5077647167946,0,{"$f":"IF(AND(R132=1,S132>=SC_LT,V132<>0,OR(IF(AND($G$4=$J$4,B132=\"X\"),TRUE,FALSE),IF(AND($G$4=$J$3,A132=\"X\",D132<>$O$4),TRUE,FALSE))),MAX($W$25:W131)+1,0)","v":0}]
[null,null,"51x5-801",50.8,5,800.79410655022355,159.15882131004471,151.15882131004471,226523.32781680438,20371.264863121316,1498.5782890710566,17.201817031800694,4,1.5697471648587953,7.6583477002487284,75,83.031208277693551,1,171429,4220.3433802058689,-1720.3433802058689,0,{"$f":"IF(AND(R133=1,S133>=SC_LT,V133<>0,OR(IF(AND($G$4=$J$4,B133=\"X\"),TRUE,FALSE),IF(AND($G$4=$J$3,A133=\"X\",D133<>$O$4),TRUE,FALSE))),MAX($W$25:W132)+1,0)","v":0}]
[null,null,"51x5,5-1256",50.8,5.5,1255.9038957893995,227.3461628707999,219.3461628707999,328707.39746922464,26624.138709932282,1498.5782890710566,29.997896653368521,4,1.5697471648587953,7.6583477002487284,75,83.031208277693551,1,330000,6056.0992325630696,-3556.0992325630696,0,{"$f":"IF(AND(R134=1,S134>=SC_LT,V134<>0,OR(IF(AND($G$4=$J$4,B134=\"X\"),TRUE,FALSE),IF(AND($G$4=$J$3,A134=\"X\",D134<>$O$4),TRUE,FALSE))),MAX($W$25:W133)+1,0)","v":0}]
[null,null,"51x6-1902",50.8,6,1901.5474223517026,315.92457039195045,307.92457039195045,461449.07586090924,33717.143154652455,1498.5782890710566,50.049949337051153,4,1.5697471648587953,7.6583477002487284,75,83.031208277693551,1,420000,8653.9900342127803,-6153.9900342127803,0,{"$f":"IF(AND(R135=1,S135>=SC_LT,V135<>0,OR(IF(AND($G$4=$J$4,B135=\"X\"),TRUE,FALSE),IF(AND($G$4=$J$3,A135=\"X\",D135<>$O$4),TRUE,FALSE))),MAX($W$25:W134)+1,0)","v":0}]
[null,null,"67x6-1492",66.674999999999997,6,1491.9723920134395,247.66206533557326,240.66206533557326,360650.94611489022,33717.143154652455,1498.5782890710566,50.201469921869773,4,1.5697471648587953,7.6583477002487284,75,83.031208277693551,1,420000,7015.6899128597279,-4515.6899128597279,0,{"$f":"IF(AND(R136=1,S136>=SC_LT,V136<>0,OR(IF(AND($G$4=$J$4,B136=\"X\"),TRUE,FALSE),IF(AND($G$4=$J$3,A136=\"X\",D136<>$O$4),TRUE,FALSE))),MAX($W$25:W135)+1,0)","v":0}]
[null,null,"51x6,5-2791",50.8,6.5,2791.2496012473034,428.42301557650825,420.42301557650825,630036.80336873792,42059.544271489729,1498.5782890710566,80.356966044429882,4,1.5697471648587953,7.6583477002487284,75,83.031208277693551,1,490000,12228.115445195681,-9728.1154451956809,0,{"$f":"IF(AND(R137=1,S137>=SC_LT,V137<>0,OR(IF(AND($G$4=$J$4,B137=\"X\"),TRUE,FALSE),IF(AND($G$4=$J$3,A137=\"X\",D137<>$O$4),TRUE,FALSE))),MAX($W$25:W136)+1,0)","v":0}]
[null,null,"67x6,5-2192",66.674999999999997,6.5,2191.8913857392618,336.21405934450183,329.21405934450183,493353.04179062089,42059.544271489729,1498.5782890710566,80.533155597500212,4,1.5697471648587953,7.6583477002487284,75,83.031208277693551,1,490000,9830.6825831635142,-7330.6825831635142,0,{"$f":"IF(AND(R138=1,S138>=SC_LT,V138<>0,OR(IF(AND($G$4=$J$4,B138=\"X\"),TRUE,FALSE),IF(AND($G$4=$J$3,A138=\"X\",D138<>$O$4),TRUE,FALSE))),MAX($W$25:W137)+1,0)","v":0}]
[null,null,"67x7-3135",66.674999999999997,7,3134.6316787945334,446.80452554207619,439.80452554207619,659081.5134125523,51857.877233725019,1498.5782890710566,124.9692576424622,4,1.5697471648587953,7.6583477002487284,75,83.031208277693551,1,540000,13616.960450785098,-11116.960450785098,0,{"$f":"IF(AND(R139=1,S139>=SC_LT,V139<>0,OR(IF(AND($G$4=$J$4,B139=\"X\"),TRUE,FALSE),IF(AND($G$4=$J$3,A139=\"X\",D139<>$O$4),TRUE,FALSE))),MAX($W$25:W138)+1,0)","v":0}]
[null,null,"67x7,5-4378",66.674999999999997,7.5,4377.540701195273,582.67209349270308,575.67209349270308,862689.70093224838,62540.39672209759,1498.5782890710566,188.35350332955977,4,1.5697471648587953,7.6583477002487284,75,83.031208277693551,1,580000,18603.913235788554,-16103.913235788554,0,{"$f":"IF(AND(R140=1,S140>=SC_LT,V140<>0,OR(IF(AND($G$4=$J$4,B140=\"X\"),TRUE,FALSE),IF(AND($G$4=$J$3,A140=\"X\",D140<>$O$4),TRUE,FALSE))),MAX($W$25:W139)+1,0)","v":0}]
[null,null,"51x5-234",50.8,5,233.94852663755589,45.789705327511179,37.789705327511179,226523.32781680438,20371.264863121316,5994.3131562842264,1.2372329200803873,1,1.0789319666378605,7.1675325020277931,75,83.031208277693551,1,0,456.78618914769487,2043.2138108523052,"Ex_Center",{"$f":"IF(AND(R141=1,S141>=SC_LT,V141<>0,OR(IF(AND($G$4=$J$4,B141=\"X\"),TRUE,FALSE),IF(AND($G$4=$J$3,A141=\"X\",D141<>$O$4),TRUE,FALSE))),MAX($W$25:W140)+1,0)","v":0}]
[null,null,"51x5,5-351",50.8,5.5,351.10097394734987,62.836540717699975,54.836540717699975,328707.39746922464,26624.138709932282,5994.3131562842264,2.0727907068041942,1,1.0789319666378605,7.1675325020277931,75,83.031208277693551,1,0,577.5224027085028,1922.4775972914972,"Ex_Center",{"$f":"IF(AND(R142=1,S142>=SC_LT,V142<>0,OR(IF(AND($G$4=$J$4,B142=\"X\"),TRUE,FALSE),IF(AND($G$4=$J$3,A142=\"X\",D142<>$O$4),TRUE,FALSE))),MAX($W$25:W141)+1,0)","v":0}]
[null,null,"51x6-516",50.8,6,515.88685558792565,84.981142597987613,76.981142597987613,461449.07586090924,33717.143154652455,5994.3131562842264,3.3657574309250142,1,1.0789319666378605,7.1675325020277931,75,83.031208277693551,1,0,745.89205060009238,1754.1079493999077,"Ex_Center",{"$f":"IF(AND(R143=1,S143>=SC_LT,V143<>0,OR(IF(AND($G$4=$J$4,B143=\"X\"),TRUE,FALSE),IF(AND($G$4=$J$3,A143=\"X\",D143<>$O$4),TRUE,FALSE))),MAX($W$25:W142)+1,0)","v":0}]
[null,null,"67x6-409",66.674999999999997,6,408.99309800335993,67.165516333893322,60.165516333893315,360650.94611489022,33717.143154652455,5994.3131562842264,3.4036375771296661,1,1.0789319666378605,7.1675325020277931,75,83.031208277693551,1,0,638.99829301552677,1861.0017069844732,"Ex_Center",{"$f":"IF(AND(R144=1,S144>=SC_LT,V144<>0,OR(IF(AND($G$4=$J$4,B144=\"X\"),TRUE,FALSE),IF(AND($G$4=$J$3,A144=\"X\",D144<>$O$4),TRUE,FALSE))),MAX($W$25:W143)+1,0)","v":0}]
[null,null,"51x6,5-742",50.8,6.5,741.68740031182585,113.10575389412706,105.10575389412706,630036.80336873792,42059.544271489729,5994.3131562842264,5.3036571884855448,1,1.0789319666378605,7.1675325020277931,75,83.031208277693551,1,10833,975.27636157500649,1524.7236384249936,"Ex_Center",{"$f":"IF(AND(R145=1,S145>=SC_LT,V145<>0,OR(IF(AND($G$4=$J$4,B145=\"X\"),TRUE,FALSE),IF(AND($G$4=$J$3,A145=\"X\",D145<>$O$4),TRUE,FALSE))),MAX($W$25:W144)+1,0)","v":0}]
[null,null,"67x6,5-587",66.674999999999997,6.5,586.97284643481544,89.303514836125458,82.303514836125458,493353.04179062089,42059.544271489729,5994.3131562842264,5.3477045767531273,1,1.0789319666378605,7.1675325020277931,75,83.031208277693551,1,10833,820.56180769799607,1679.4381923020039,"Ex_Center",{"$f":"IF(AND(R146=1,S146>=SC_LT,V146<>0,OR(IF(AND($G$4=$J$4,B146=\"X\"),TRUE,FALSE),IF(AND($G$4=$J$3,A146=\"X\",D146<>$O$4),TRUE,FALSE))),MAX($W$25:W145)+1,0)","v":0}]
[null,null,"67x7-826",66.674999999999997,7,825.65791969863335,116.95113138551905,109.95113138551905,659081.5134125523,51857.877233725019,5994.3131562842264,8.177679071156831,1,1.0789319666378605,7.1675325020277931,75,83.031208277693551,1,30000,1062.8306472128279,1437.1693527871721,"Ex_Center",{"$f":"IF(AND(R147=1,S147>=SC_LT,V147<>0,OR(IF(AND($G$4=$J$4,B147=\"X\"),TRUE,FALSE),IF(AND($G$4=$J$3,A147=\"X\",D147<>$O$4),TRUE,FALSE))),MAX($W$25:W146)+1,0)","v":0}]
[null,null,"67x7,5-1139",66.674999999999997,7.5,1139.3851752988182,150.91802337317577,143.91802337317577,862689.70093224838,62540.39672209759,5994.3131562842264,12.196370280716913,1,1.0789319666378605,7.1675325020277931,75,83.031208277693551,1,71875,1380.1416690640267,1119.8583309359733,"Ex_Center",{"$f":"IF(AND(R148=1,S148>=SC_LT,V148<>0,OR(IF(AND($G$4=$J$4,B148=\"X\"),TRUE,FALSE),IF(AND($G$4=$J$3,A148=\"X\",D148<>$O$4),TRUE,FALSE))),MAX($W$25:W147)+1,0)","v":0}]
[null,null,"51x5-612",50.8,5,611.84557991266774,121.36911598253354,113.36911598253354,226523.32781680438,20371.264863121316,1998.1043854280754,9.8381414359807362,3,1.4061420987851507,7.4947426341750836,75,83.031208277693537,1,56250,2508.9578792506295,-8.9578792506295031,0,{"$f":"IF(AND(R149=1,S149>=SC_LT,V149<>0,OR(IF(AND($G$4=$J$4,B149=\"X\"),TRUE,FALSE),IF(AND($G$4=$J$3,A149=\"X\",D149<>$O$4),TRUE,FALSE))),MAX($W$25:W148)+1,0)","v":0}]
[null,null,"51x5,5-954",50.8,5.5,954.30292184204973,172.50962215309994,164.50962215309994,328707.39746922464,26624.138709932282,1998.1043854280754,17.071739033488456,3,1.4061420987851507,7.4947426341750836,75,83.031208277693537,1,157143,3547.5720189900376,-1047.5720189900376,0,{"$f":"IF(AND(R150=1,S150>=SC_LT,V150<>0,OR(IF(AND($G$4=$J$4,B150=\"X\"),TRUE,FALSE),IF(AND($G$4=$J$3,A150=\"X\",D150<>$O$4),TRUE,FALSE))),MAX($W$25:W149)+1,0)","v":0}]
[null,null,"51x6-1440",50.8,6,1439.6605667637771,238.94342779396285,230.94342779396285,461449.07586090924,33717.143154652455,1998.1043854280754,28.390732099450595,3,1.4061420987851507,7.4947426341750836,75,83.031208277693537,1,310000,5014.8870677064824,-2514.8870677064824,0,{"$f":"IF(AND(R151=1,S151>=SC_LT,V151<>0,OR(IF(AND($G$4=$J$4,B151=\"X\"),TRUE,FALSE),IF(AND($G$4=$J$3,A151=\"X\",D151<>$O$4),TRUE,FALSE))),MAX($W$25:W150)+1,0)","v":0}]
[null,null,"67x6-1131",66.674999999999997,6,1130.9792940100797,187.49654900167997,180.49654900167997,360650.94611489022,33717.143154652455,1998.1043854280754,28.504372538064558,3,1.4061420987851507,7.4947426341750836,75,83.031208277693537,1,310000,4088.8432494453909,-1588.8432494453909,0,{"$f":"IF(AND(R152=1,S152>=SC_LT,V152<>0,OR(IF(AND($G$4=$J$4,B152=\"X\"),TRUE,FALSE),IF(AND($G$4=$J$3,A152=\"X\",D152<>$O$4),TRUE,FALSE))),MAX($W$25:W151)+1,0)","v":0}]
[null,null,"51x6,5-2108",50.8,6.5,2108.0622009354779,323.31726168238123,315.31726168238123,630036.80336873792,42059.544271489729,1998.1043854280754,45.482140210700493,3,1.4061420987851507,7.4947426341750836,75,83.031208277693537,1,390000,7031.3340841728477,-4531.3340841728477,0,{"$f":"IF(AND(R153=1,S153>=SC_LT,V153<>0,OR(IF(AND($G$4=$J$4,B153=\"X\"),TRUE,FALSE),IF(AND($G$4=$J$3,A153=\"X\",D153<>$O$4),TRUE,FALSE))),MAX($W$25:W152)+1,0)","v":0}]
[null,null,"67x6,5-1657",66.674999999999997,6.5,1656.9185393044465,253.9105445083764,246.9105445083764,493353.04179062089,42059.544271489729,1998.1043854280754,45.614282375503237,3,1.4061420987851507,7.4947426341750836,75,83.031208277693537,1,390000,5677.9030992797543,-3177.9030992797543,0,{"$f":"IF(AND(R154=1,S154>=SC_LT,V154<>0,OR(IF(AND($G$4=$J$4,B154=\"X\"),TRUE,FALSE),IF(AND($G$4=$J$3,A154=\"X\",D154<>$O$4),TRUE,FALSE))),MAX($W$25:W153)+1,0)","v":0}]
[null,null,"67x7-2365",66.674999999999997,7,2364.9737590959003,336.85339415655716,329.85339415655716,659081.5134125523,51857.877233725019,1998.1043854280754,70.662307892387929,3,1.4061420987851507,7.4947426341750836,75,83.031208277693537,1,460000,7813.310872605377,-5313.310872605377,0,{"$f":"IF(AND(R155=1,S155>=SC_LT,V155<>0,OR(IF(AND($G$4=$J$4,B155=\"X\"),TRUE,FALSE),IF(AND($G$4=$J$3,A155=\"X\",D155<>$O$4),TRUE,FALSE))),MAX($W$25:W154)+1,0)","v":0}]
[null,null,"67x7,5-3298",66.674999999999997,7.5,3298.1555258964549,438.75407011952734,431.75407011952734,862689.70093224838,62540.39672209759,1998.1043854280754,106.37312194549682,3,1.4061420987851507,7.4947426341750836,75,83.031208277693537,1,510000,10624.098286958304,-8124.098286958304,0,{"$f":"IF(AND(R156=1,S156>=SC_LT,V156<>0,OR(IF(AND($G$4=$J$4,B156=\"X\"),TRUE,FALSE),IF(AND($G$4=$J$3,A156=\"X\",D156<>$O$4),TRUE,FALSE))),MAX($W$25:W155)+1,0)","v":0}]
[]
[]
[]
[null,null,-0.03,null,10000]
[null,null,-0.02,null,10833]
[null,null,-0.01,null,11667]
[null,null,0,null,12500]
[null,null,0.01,1,13125]
[null,null,0.02,1,13750]
[null,null,0.03,1,14375]
[null,null,0.04,1,15000]
[null,null,0.05,1,15833]
[null,null,0.06,1,16667]
[null,null,7.0000000000000007E-2,1,17500]
[null,null,0.08,1,18333]
[null,null,0.09,1,19167]
[null,null,0.1,1,20000]
[null,null,0.11,1,21250]
[null,null,0.12,1,22500]
[null,null,0.13,1,23750]
[null,null,0.14000000000000001,1,25000]
[null,null,0.15,1,26667]
[null,null,0.16,1,28333]
[null,null,0.17,1,30000]
[null,null,0.18,1,31667]
[null,null,0.19,1,33333]
[null,null,0.2,1.01,35000]
[null,null,0.21,1.01,38250]
[null,null,0.22,1.02,41500]
[null,null,0.23,1.02,44750]
[null,null,0.24,1.03,50000]
[null,null,0.25,1.04,53125]
[null,null,0.26,1.05,56250]
[null,null,0.27,1.05,59375]
[null,null,0.28000000000000003,1.06,62500]
[null,null,0.28999999999999998,1.06,65625]
[null,null,0.3,1.07,68750]
[null,null,0.31,1.07,71875]
[null,null,0.32,1.08,75000]
[null,null,0.33,1.08,78125]
[null,null,0.34,1.0900000000000001,81250]
[null,null,0.35,1.0900000000000001,84375]
[null,null,0.36,1.0900000000000001,87500]
[null,null,0.37,1.0900000000000001,90625]
[null,null,0.38,1.0900000000000001,93750]
[null,null,0.39,1.0900000000000001,96875]
[null,null,0.4,1.1000000000000001,100000]
[null,null,0.41,1.1000000000000001,114286]
[null,null,0.42,1.1000000000000001,128571]
[null,null,0.43,1.1000000000000001,142857]
[null,null,0.44,1.1000000000000001,157143]
[null,null,0.45,1.1000000000000001,171429]
[null,null,0.46,1.1000000000000001,185714]
[null,null,0.47,1.1000000000000001,200000]
[null,null,0.48,1.1000000000000001,212500]
[null,null,0.49,1.1000000000000001,225000]
[null,null,0.5,1.1100000000000001,237500]
[null,null,0.51,1.1100000000000001,250000]
[null,null,0.52,1.1100000000000001,262500]
[null,null,0.53,1.1100000000000001,275000]
[null,null,0.54,1.1100000000000001,287500]
[null,null,0.55000000000000004,1.1100000000000001,300000]
[null,null,0.56000000000000005,1.1100000000000001,310000]
[null,null,0.56999999999999995,1.1100000000000001,320000]
[null,null,0.57999999999999996,1.1100000000000001,330000]
[null,null,0.59,1.1100000000000001,340000]
[null,null,0.6,1.1100000000000001,350000]
[null,null,0.61,1.1100000000000001,360000]
[null,null,0.62,1.1100000000000001,370000]
[null,null,0.63,1.1100000000000001,380000]
[null,null,0.64,1.1100000000000001,390000]
[null,null,0.65,1.1100000000000001,400000]
[null,null,0.66,1.1100000000000001,410000]
[null,null,0.67,1.1100000000000001,420000]
[null,null,0.68,1.1100000000000001,430000]
[null,null,0.69,1.1100000000000001,440000]
[null,null,0.7,1.1100000000000001,450000]
[null,null,0.71,1.1100000000000001,460000]
[null,null,0.72,1.1100000000000001,470000]
[null,null,0.73,1.1100000000000001,480000]
[null,null,0.74,1.1100000000000001,490000]
[null,null,0.75,1.1100000000000001,500000]
[null,null,0.76,1.1100000000000001,510000]
[null,null,0.77,1.1100000000000001,520000]
[null,null,0.78,1.1100000000000001,530000]
[null,null,0.79,1.1100000000000001,540000]
[null,null,0.8,1.1100000000000001,550000]
[null,null,0.81,1.1100000000000001,560000]
[null,null,0.82,1.1100000000000001,570000]
[null,null,0.83,1.1100000000000001,580000]
[null,null,0.84,1.1100000000000001,590000]
[null,null,0.85,1.1100000000000001,600000]
[null,null,0.86,1.1100000000000001,610000]
[null,null,0.87,1.1100000000000001,620000]
[null,null,0.88,1.1100000000000001,630000]
[null,null,0.89,1.1100000000000001,640000]
[null,null,0.9,1.1100000000000001,650000]
[null,null,0.91,1.1100000000000001,660000]
[null,null,0.92,1.1100000000000001,670000]
[null,null,0.93,1.1100000000000001,680000]
[null,null,0.94,1.1100000000000001,690000]
[null,null,0.95,1.1100000000000001,700000]
[null,null,0.96,1.1100000000000001,710000]
[null,null,0.97,1.1100000000000001,720000]
[null,null,0.98,1.1100000000000001,730000]
[null,null,0.99,1.1100000000000001,740000]
[null,null,1,1.1100000000000001,750000]

{"sheet":"Date","index":3,"n_rows":11,"n_cols":2,"rows_kept":11,"cut":false,"hidden":true,"merged":[]}
[]
["today",{"$f":"TODAY()","v":"2021-03-12"}]
[]
["release date","2021-03-01"]
["expiration date",{"$f":"B4+365","v":"2022-03-01"}]
[]
["days",{"$f":"B2-B4","v":11}]
[]
["warning","This file is more than one year old."]
[null,"Please check if you have the latest version.  "]
[null,"www.doco-international.com/en/support"]

{"sheet":"Matrix","index":4,"n_rows":83,"n_cols":72,"rows_kept":83,"cut":false,"hidden":true,"merged":[]}
[null,null,null,null,null,null,null,null,null,null,null,null,null,null,null,null,null,null,null,null,null,null,null,null,null,null,null,null,null,null,null,null,null,null,null,null,null,null,null,null,null,null,null,null,null,null,null,null,null,null,null,null,null,null,null,null,null,null,null,null,null,null,null,null,null,null,null,null,null,null,null,{"$f":"COLUMN()","v":72}]
[null,"DH-KG",1775,{"$f":"C2+25","v":1800},{"$f":"D2+25","v":1825},1850,1875,1900,1925,1950,1975,2000,2025,2050,2075,2100,2125,2150,2175,2200,2225,2250,2275,2300,2325,2350,2375,2400,2425,2450,2475,2500,2525,2550,2575,2600,2625,2650,2675,2700,2725,2750,2775,2800,2825,2850,2875,{"$f":"AU2+25","v":2900},2925,2950,2975,3000,3025,3050,3075,3100,3125,3150,3175,3200,3225,3250,3275,3300,3325,3350,3375,3400,{"$f":"BP2+25","v":3425},3450,3475,3500]
[null,40,3295006632,3295006632,3295006632,"-","-","-","-","-","-","-","-","-","-","-","-","-","-","-","-","-","-","-","-","-","-","-","-","-","-","-","-","-","-","-","-","-","-","-","-","-","-","-","-","-","-","-","-","-","-","-","-","-","-","-","-","-","-","-","-","-","-","-","-","-","-","-","-","-","-","-"]
[null,{"$f":"B3+2","v":42},3295006192,3295006632,3295006632,3295006632,3295006632,3295006632,3295006632,"-","-","-","-","-","-","-","-","-","-","-","-","-","-","-","-","-","-","-","-","-","-","-","-","-","-","-","-","-","-","-","-","-","-","-","-","-","-","-","-","-","-","-","-","-","-","-","-","-","-","-","-","-","-","-","-","-","-","-","-","-","-","-"]
[null,{"$f":"B4+2","v":44},3295006192,3295006192,3295006192,3295006192,3295006632,3295006632,3295006632,3295006632,3295006632,3295006632,3295006632,"-","-","-","-","-","-","-","-","-","-","-","-","-","-","-","-","-","-","-","-","-","-","-","-","-","-","-","-","-","-","-","-","-","-","-","-","-","-","-","-","-","-","-","-","-","-","-","-","-","-","-","-","-","-","-","-","-","-","-"]
[null,46,3295005762,3295005762,3295006192,3295006192,3295006192,3295006192,3295006192,3295006192,3295006632,3295006632,3295006632,3295006632,3295006632,3295006632,3295006632,"-","-","-","-","-","-","-","-","-","-","-","-","-","-","-","-","-","-","-","-","-","-","-","-","-","-","-","-","-","-","-","-","-","-","-","-","-","-","-","-","-","-","-","-","-","-","-","-","-","-","-","-","-","-","-"]
[null,48,3295005762,3295005762,3295005762,3295005762,3295005762,3295006192,3295006192,3295006192,3295006192,3295006192,3295006192,3295006192,3295006632,3295006632,3295006632,3295006632,3295006632,3295006632,3295006632,"-","-","-","-","-","-","-","-","-","-","-","-","-","-","-","-","-","-","-","-","-","-","-","-","-","-","-","-","-","-","-","-","-","-","-","-","-","-","-","-","-","-","-","-","-","-","-","-","-","-","-"]
[null,50,3295005332,3295005762,3295005762,3295005762,3295005762,3295005762,3295005762,3295005762,3295005762,3295006192,3295006192,3295006192,3295006192,3295006192,3295006192,3295006192,3295006632,3295006632,3295006632,3295006632,3295006632,3295006632,3295006632,"-","-","-","-","-","-","-","-","-","-","-","-","-","-","-","-","-","-","-","-","-","-","-","-","-","-","-","-","-","-","-","-","-","-","-","-","-","-","-","-","-","-","-","-","-","-","-"]
[null,52,3295005332,3295005332,3295005332,3295005332,3295005332,3295005762,3295005762,3295005762,3295005762,3295005762,3295005762,3295005762,3295006192,3295006192,3295006192,3295006192,3295006192,3295006192,3295006192,3295006632,3295006632,3295006632,3295006632,3295006632,3295006632,3295006632,3295006632,"-","-","-","-","-","-","-","-","-","-","-","-","-","-","-","-","-","-","-","-","-","-","-","-","-","-","-","-","-","-","-","-","-","-","-","-","-","-","-","-","-","-","-"]
[null,54,3295005332,3295005332,3295005332,3295005332,3295005332,3295005332,3295005332,3295005332,3295005762,3295005762,3295005762,3295005762,3295005762,3295005762,3295005762,3295005762,3295006192,3295006192,3295006192,3295006192,3295006192,3295006192,3295006192,3295006632,3295006632,3295006632,3295006632,3295006632,3295006632,3295006632,3295006632,"-","-","-","-","-","-","-","-","-","-","-","-","-","-","-","-","-","-","-","-","-","-","-","-","-","-","-","-","-","-","-","-","-","-","-","-","-","-","-"]
[null,56,3295004902,3295004902,3295004902,3295005332,3295005332,3295005332,3295005332,3295005332,3295005332,3295005332,3295005332,3295005762,3295005762,3295005762,3295005762,3295005762,3295005762,3295005762,3295005762,3295006192,3295006192,3295006192,3295006192,3295006192,3295006192,3295006192,3295006192,3295006632,3295006632,3295006632,3295006632,3295006632,3295006632,3295006632,3295006632,"-","-","-","-","-","-","-","-","-","-","-","-","-","-","-","-","-","-","-","-","-","-","-","-","-","-","-","-","-","-","-","-","-","-","-"]
[null,58,3295004902,3295004902,3295004902,3295004902,3295004902,3295004902,3295005332,3295005332,3295005332,3295005332,3295005332,3295005332,3295005332,3295005332,3295005762,3295005762,3295005762,3295005762,3295005762,3295005762,3295005762,3295005762,3295005762,3295006192,3295006192,3295006192,3295006192,3295006192,3295006192,3295006192,3295006192,3295006632,3295006632,3295006632,3295006632,3295006632,3295006632,3295006632,3295006632,"-","-","-","-","-","-","-","-","-","-","-","-","-","-","-","-","-","-","-","-","-","-","-","-","-","-","-","-","-","-","-"]
[null,60,3295004482,3295004902,3295004902,3295004902,3295004902,3295004902,3295004902,3295004902,3295004902,3295005332,3295005332,3295005332,3295005332,3295005332,3295005332,3295005332,3295005332,3295005332,3295005762,3295005762,3295005762,3295005762,3295005762,3295005762,3295005762,3295005762,3295006192,3295006192,3295006192,3295006192,3295006192,3295006192,3295006192,3295006192,3295006192,3295006632,3295006632,3295006632,3295006632,3295006632,3295006632,3295006632,3295006632,"-","-","-","-","-","-","-","-","-","-","-","-","-","-","-","-","-","-","-","-","-","-","-","-","-","-","-"]
[null,62,3295004482,3295004482,3295004482,3295004902,3295004902,3295004902,3295004902,3295004902,3295004902,3295004902,3295004902,3295004902,3295005332,3295005332,3295005332,3295005332,3295005332,3295005332,3295005332,3295005332,3295005332,3295005762,3295005762,3295005762,3295005762,3295005762,3295005762,3295005762,3295005762,3295005762,3295006192,3295006192,3295006192,3295006192,3295006192,3295006192,3295006192,3295006192,3295006632,3295006632,3295006632,3295006632,3295006632,3295006632,3295006632,3295006632,3295006632,"-","-","-","-","-","-","-","-","-","-","-","-","-","-","-","-","-","-","-","-","-","-","-"]
[null,64,3295004482,3295004482,3295004482,3295004482,3295004482,3295004482,3295004902,3295004902,3295004902,3295004902,3295004902,3295004902,3295004902,3295004902,3295004902,3295005332,3295005332,3295005332,3295005332,3295005332,3295005332,3295005332,3295005332,3295005332,3295005762,3295005762,3295005762,3295005762,3295005762,3295005762,3295005762,3295005762,3295005762,3295006192,3295006192,3295006192,3295006192,3295006192,3295006192,3295006192,3295006192,3295006192,3295006632,3295006632,3295006632,3295006632,3295006632,3295006632,3295006632,3295006632,3295006632,"-","-","-","-","-","-","-","-","-","-","-","-","-","-","-","-","-","-","-"]
[null,66,3295004482,3295004482,3295004482,3295004482,3295004482,3295004482,3295004482,3295004482,3295004482,3295004902,3295004902,3295004902,3295004902,3295004902,3295004902,3295004902,3295004902,3295004902,3295005332,3295005332,3295005332,3295005332,3295005332,3295005332,3295005332,3295005332,3295005332,3295005762,3295005762,3295005762,3295005762,3295005762,3295005762,3295005762,3295005762,3295005762,3295006192,3295006192,3295006192,3295006192,3295006192,3295006192,3295006192,3295006192,3295006192,3295006192,3295006632,3295006632,3295006632,3295006632,3295006632,3295006632,3295006632,3295006632,3295006632,"-","-","-","-","-","-","-","-","-","-","-","-","-","-","-"]
[null,68,3295004482,3295004482,3295004482,3295004482,3295004482,3295004482,3295004482,3295004482,3295004482,3295004902,3295004902,3295004902,3295004902,3295004902,3295004902,3295004902,3295004902,3295004902,3295004902,3295005332,3295005332,3295005332,3295005332,3295005332,3295005332,3295005332,3295005332,3295005332,3295306972,3295005762,3295005762,3295005762,3295005762,3295005762,3295005762,3295005762,3295005762,3295005762,3295006192,3295006192,3295006192,3295006192,3295006192,3295006192,3295006192,3295006192,3295006192,3295006192,3295006632,3295006632,3295006632,3295006632,3295006632,3295006632,3295006632,3295006632,3295006632,3295006632,3295006632,"-","-","-","-","-","-","-","-","-","-","-"]
[null,70,3295305512,3295305512,3295004482,3295004482,3295004482,3295004482,3295004482,3295004482,3295004482,3295306002,3295306002,3295306002,3295004902,3295004902,3295004902,3295004902,3295004902,3295004902,3295306492,3295306492,3295306492,3295306492,3295005332,3295005332,3295005332,3295005332,3295005332,3295005332,3295306972,3295306972,3295306972,3295306972,3295005762,3295005762,3295005762,3295005762,3295005762,3295307462,3295307462,3295307462,3295307462,3295307462,3295006192,3295006192,3295006192,3295006192,3295307952,3295307952,3295307952,3295307952,3295006192,3295006192,3295006632,3295006632,3295006632,3295006632,3295006632,3295006632,3295006632,3295006632,3295006632,3295006632,3295006632,"-","-","-","-","-","-","-"]
[null,72,3295305032,3295305032,3295305512,3295305512,3295305512,3295004482,3295004482,3295004482,3295004482,3295305512,3295305512,3295306002,3295306002,3295306002,3295306002,3295004902,3295004902,3295004902,3295306002,3295306002,3295306492,3295306492,3295306492,3295306492,3295306492,3295306492,3295005332,3295306492,3295306972,3295306972,3295306972,3295306972,3295306972,3295306972,3295306972,3295306972,3295005762,3295307462,3295307462,3295307462,3295307462,3295307462,3295307462,3295307462,3295307462,3295307952,3295307952,3295307952,3295307952,3295307952,3295307952,3295307952,3295307952,3295307952,3295006192,3295006192,3295006192,3295006632,3295006632,3295006632,3295006632,3295006632,3295006632,3295006632,3295006632,3295006632,3295006632,"-","-","-"]
[null,74,3295305032,3295305032,3295305032,3295305032,3295305032,3295305512,3295305512,3295305512,3295004482,3295305512,3295305512,3295305512,3295305512,3295306002,3295306002,3295306002,3295306002,3295306002,3295306002,3295306002,3295306002,3295306002,3295306492,3295306492,3295306492,3295306492,3295306492,3295306492,3295306492,3295306492,3295306492,3295306972,3295306972,3295306972,3295306972,3295306972,3295306972,3295306972,3295306972,3295306972,3295307462,3295307462,3295307462,3295307462,3295307462,3295307462,3295307462,3295307462,3295307462,3295307952,3295307952,3295307952,3295307952,3295307952,3295307952,3295307952,3295307952,3295307952,"-","-","-",3295006632,3295006632,3295006632,3295006632,3295006632,3295006632,"-","-","-"]
[null,76,3295305032,3295305032,3295305032,3295305032,3295305032,3295305032,3295305032,3295305512,3295305512,3295305512,3295305512,3295305512,3295305512,3295305512,3295305512,3295305512,3295306002,3295306002,3295306002,3295306002,3295306002,3295306002,3295306002,3295306002,3295306002,3295306492,3295306492,3295306492,3295306492,3295306492,3295306492,3295306492,3295306492,3295306492,3295306972,3295306972,3295306972,3295306972,3295306972,3295306972,3295306972,3295306972,3295306972,3295307462,3295307462,3295307462,3295307462,3295307462,3295307462,3295307462,3295307462,3295307462,3295307952,3295307952,3295307952,3295307952,3295307952,3295307952,3295307952,3295307952,3295307952,"-","-","-","-",3295006632,"-","-","-","-"]
[null,78,3295305032,3295305032,3295305032,3295305032,3295305032,3295305032,3295305032,3295305032,3295305032,3295305512,3295305512,3295305512,3295305512,3295305512,3295305512,3295305512,3295305512,3295305512,3295306002,3295306002,3295306002,3295306002,3295306002,3295306002,3295306002,3295306002,3295306002,3295306002,3295306492,3295306492,3295306492,3295306492,3295306492,3295306492,3295306492,3295306492,3295306492,3295306972,3295306972,3295306972,3295306972,3295306972,3295306972,3295306972,3295306972,3295306972,3295307462,3295307462,3295307462,3295307462,3295307462,3295307462,3295307462,3295307462,3295307462,3295307462,3295307952,3295307952,3295307952,3295307952,3295307952,3295307952,3295307952,3295307952,3295307952,"-","-","-","-","-"]
[null,80,3295305032,3295305032,3295305032,3295305032,3295305032,3295305032,3295305032,3295305032,3295305032,3295305032,3295305512,3295305512,3295305512,3295305512,3295305512,3295305512,3295305512,3295305512,3295305512,3295305512,3295306002,3295306002,3295306002,3295306002,3295306002,3295306002,3295306002,3295306002,3295306002,3295306492,3295306492,3295306492,3295306492,3295306492,3295306492,3295306492,3295306492,3295306492,3295306492,3295306972,3295306972,3295306972,3295306972,3295306972,3295306972,3295306972,3295306972,3295306972,3295307462,3295307462,3295307462,3295307462,3295307462,3295307462,3295307462,3295307462,3295307462,3295307462,3295307952,3295307952,3295307952,3295307952,3295307952,3295307952,3295307952,3295307952,3295307952,3295307952,3295307952,"-"]
[null,82,3295505412,3295505412,3295305032,3295305032,3295305032,3295305032,3295305032,3295305032,3295305032,3295305032,3295505932,3295505932,3295305512,3295305512,3295305512,3295305512,3295305512,3295305512,3295305512,3295506462,3295506462,3295506462,3295306002,3295306002,3295306002,3295306002,3295306002,3295306002,3295306002,3295506982,3295506982,3295507512,3295306492,3295306492,3295306492,3295306492,3295306492,3295306492,3295507512,3295507512,3295508042,3295508042,3295306972,3295306972,3295306972,3295306972,3295306972,3295306972,3295508042,3295508572,3295508572,3295508572,3295307462,3295307462,3295307462,3295307462,3295307462,3295508572,3295307462,3295307462,3295307462,3295307462,3295307952,3295307952,3295307952,3295307952,3295307952,3295307952,3295307952,3295307952]
[null,84,3295505412,3295505412,3295505412,3295505412,3295305032,3295305032,3295305032,3295305032,3295305032,3295505932,3295505932,3295505932,3295505932,3295505932,3295305512,3295305512,3295305512,3295305512,3295305512,3295506462,3295506462,3295506462,3295506462,3295506462,3295506462,3295306002,3295306002,3295306002,3295506982,3295506982,3295506982,3295506982,3295506982,3295507512,3295507512,3295306492,3295306492,3295306492,3295507512,3295507512,3295507512,3295507512,3295507512,3295508042,3295508042,3295306972,3295306972,3295508042,3295508042,3295508042,3295508042,3295508042,3295508572,3295508572,3295508572,3295307462,3295307462,3295508572,3295508572,3295508572,3295508572,3295307462,3295307462,3295307462,3295307462,3295307952,3295307952,3295307952,3295307952,3295307952]
[null,86,3295505412,3295505412,3295505412,3295505412,3295505412,3295505412,3295305032,3295305032,3295305032,3295505932,3295505932,3295505932,3295505932,3295505932,3295505932,3295505932,3295505932,3295305512,3295506462,3295506462,3295506462,3295506462,3295506462,3295506462,3295506462,3295506462,3295506462,3295306002,3295506982,3295506982,3295506982,3295506982,3295506982,3295506982,3295506982,3295506982,3295507512,3295507512,3295507512,3295507512,3295507512,3295507512,3295507512,3295507512,3295507512,3295508042,3295508042,3295508042,3295508042,3295508042,3295508042,3295508042,3295508042,3295508042,3295508042,3295508572,3295508572,3295508572,3295508572,3295508572,3295508572,3295508572,3295508572,3295508572,3295307462,3295307462,3295307462,3295307462,"-",3295307952]
[null,88,3295505412,3295505412,3295505412,3295505412,3295505412,3295505412,3295505412,3295505412,3295505412,3295505412,3295505932,3295505932,3295505932,3295505932,3295505932,3295505932,3295505932,3295505932,3295505932,3295505932,3295506462,3295506462,3295506462,3295506462,3295506462,3295506462,3295506462,3295506462,3295506462,3295506982,3295506982,3295506982,3295506982,3295506982,3295506982,3295506982,3295506982,3295506982,3295506982,3295507512,3295507512,3295507512,3295507512,3295507512,3295507512,3295507512,3295507512,3295507512,3295508042,3295508042,3295508042,3295508042,3295508042,3295508042,3295508042,3295508042,3295508042,3295508042,3295508572,3295508572,3295508572,3295508572,3295508572,3295508572,3295508572,3295508572,3295508572,"-","-","-"]
[null,90,3296007112,3295505412,3295505412,3295505412,3295505412,3295505412,3295505412,3295505412,3295505412,3295505412,3296008382,3295505932,3295505932,3295505932,3295505932,3295505932,3295505932,3295505932,3295505932,3295505932,3296009022,3295506462,3295506462,3295506462,3295506462,3295506462,3295506462,3295506462,3295506462,3295506462,3295506982,3295506982,3295506982,3295506982,3295506982,3295506982,3295506982,3295506982,3295506982,3296010942,3295507512,3295507512,3295507512,3295507512,3295507512,3295507512,3295507512,3295507512,3295507512,3396009112,3295508042,3295508042,3295508042,3295508042,3295508042,3295508042,3295508042,3295508042,3396009612,3396009612,3295508572,3295508572,3295508572,3295508572,3295508572,3295508572,3295508572,3295508572,3295508572,3295508572]
[null,92,3296007112,3296007112,3296007112,3295505412,3295505412,3295505412,3295505412,3295505412,3295505412,3295505412,3296007752,3296008382,3296008382,3295505932,3295505932,3295505932,3295505932,3295505932,3295505932,3295505932,3296009022,3296009022,3296009022,3295506462,3295506462,3295506462,3295506462,3295506462,3295506462,3296009662,3296009662,3296009662,3296009662,3295506982,3295506982,3295506982,3295506982,3295506982,3295506982,3296010302,3296010302,3296010302,3296010942,3295507512,3295507512,3295507512,3295507512,3295507512,3296010942,3296010942,3396009112,3396009112,3396009112,3295508042,3295508042,3295508042,3295508042,3295508042,3396009612,3396009612,3396009612,3396009612,3396009612,3295508572,3295508572,3295508572,3295508572,3295508572,3295508572,3295508572]
[null,94,3296007112,3296007112,3296007112,3296007112,3296007752,3295505412,3295505412,3295505412,3295505412,3295505412,3296007752,3296007752,3296008382,3296008382,3296008382,3295505932,3295505932,3295505932,3295505932,3296008382,3296009022,3296009022,3296009022,3296009022,3296009022,3296009022,3295506462,3295506462,3295506462,3296009662,3296009662,3296009662,3296009662,3296009662,3296009662,3296009662,3295506982,3295506982,3296010302,3296010302,3296010302,3296010302,3296010302,3296010302,3296010302,3296010942,3295507512,3295507512,3296010942,3296010942,3296010942,3296010942,3296010942,3396009112,3396009112,3396009112,3295508042,3295508042,3396009112,3396009112,3396009112,3396009612,3396009612,3396009612,3396009612,3396009612,3396009612,3396009612,3396009612,3295508572]
[null,96,3296007112,3296007112,3296007112,3296007112,3296007112,3296007112,3296007752,3295505412,3295505412,3296007752,3296007752,3296007752,3296007752,3296007752,3296008382,3296008382,3296008382,3295505932,3295505932,3296008382,3296008382,3296008382,3296008382,3296009022,3296009022,3296009022,3296009022,3296009022,3295506462,3296009022,3296009022,3296009662,3296009662,3296009662,3296009662,3296009662,3296009662,3296009662,3296009662,3296010302,3296010302,3296010302,3296010302,3296010302,3296010302,3296010302,3296010302,3296010942,3296010942,3296010942,3296010942,3296010942,3296010942,3296010942,3296010942,3396009112,3396009112,3396009112,3396009112,3396009112,3396009112,3396009112,3396009112,3396009112,3396009612,3396009612,3396009612,3396009612,3396009612,3396009612]
[null,98,3296007112,3296007112,3296007112,3296007112,3296007112,3296007112,3296007112,3296007112,3296007752,3296007752,3296007752,3296007752,3296007752,3296007752,3296007752,3296007752,3296008382,3296008382,3296008382,3296008382,3296008382,3296008382,3296008382,3296008382,3296008382,3296009022,3296009022,3296009022,3296009022,3296009022,3296009022,3296009022,3296009022,3296009662,3296009662,3296009662,3296009662,3296009662,3296009662,3296009662,3296009662,3296010302,3296010302,3296010302,3296010302,3296010302,3296010302,3296010302,3296010302,3296010302,3296010942,3296010942,3296010942,3296010942,3296010942,3296010942,3296010942,3296010942,3396009112,3396009112,3396009112,3396009112,3396009112,3396009112,3396009112,3396009112,3396009112,3396009612,3396009612,3396009612]
[null,100,3296006482,3296007112,3296007112,3296007112,3296007112,3296007112,3296007112,3296007112,3296007112,3296007112,3296007752,3296007752,3296007752,3296007752,3296007752,3296007752,3296007752,3296007752,3296008382,3296008382,3296008382,3296008382,3296008382,3296008382,3296008382,3296008382,3296008382,3296009022,3296009022,3296009022,3296009022,3296009022,3296009022,3296009022,3296009022,3296009662,3296009662,3296009662,3296009662,3296009662,3296009662,3296009662,3296009662,3296009662,3296010302,3296010302,3296010302,3296010302,3296010302,3296010302,3296010302,3296010302,3296010942,3296010942,3296010942,3296010942,3296010942,3296010942,3296010942,3296010942,3296010942,3396009112,3396009112,3396009112,3396009112,3396009112,3396009112,3396009112,3396009112,3396009112]
[null,102,3296006482,3296006482,3296006482,3296007112,3296007112,3296007112,3296007112,3296007112,3296007112,3296007112,3296007112,3296007752,3296007752,3296007752,3296007752,3296007752,3296007752,3296007752,3296007752,3296007752,3296008382,3296008382,3296008382,3296008382,3296008382,3296008382,3296008382,3296008382,3296008382,3296009022,3296009022,3296009022,3296009022,3296009022,3296009022,3296009022,3296009022,3296009022,3296009662,3296009662,3296009662,3296009662,3296009662,3296009662,3296009662,3296009662,3296010302,3296010302,3296010302,3296010302,3296010302,3296010302,3296010302,3296010302,3296010302,3296010942,3296010942,3296010942,3296010942,3296010942,3296010942,3296010942,3296010942,3296010942,3396009112,3396009112,3396009112,3396009112,3396009112,3396009112]
[null,104,3296006482,3296006482,3296006482,3296006482,3296007112,3296007112,3296007112,3296007112,3296007112,3296007112,3296007112,3296007112,3296007112,3296007752,3296007752,3296007752,3296007752,3296007752,3296007752,3296007752,3296007752,3296007752,3296008382,3296008382,3296008382,3296008382,3296008382,3296008382,3296008382,3296008382,3296008382,3296009022,3296009022,3296009022,3296009022,3296009022,3296009022,3296009022,3296009022,3296009022,3296009662,3296009662,3296009662,3296009662,3296009662,3296009662,3296009662,3296009662,3296009662,3296010302,3296010302,3296010302,3296010302,3296010302,3296010302,3296010302,3296010302,3296010302,3296010942,3296010942,3296010942,3296010942,3296010942,3296010942,3296010942,3296010942,3296010942,3396009112,3396009112,3396009112]
[null,106,3296006482,3296006482,3296006482,3296006482,3296006482,3296006482,3296007112,3296007112,3296007112,3296007112,3296007112,3296007112,3296007112,3296007112,3296007112,3296007752,3296007752,3296007752,3296007752,3296007752,3296007752,3296007752,3296007752,3296007752,3296008382,3296008382,3296008382,3296008382,3296008382,3296008382,3296008382,3296008382,3296008382,3296009022,3296009022,3296009022,3296009022,3296009022,3296009022,3296009022,3296009022,3296009022,3296009662,3296009662,3296009662,3296009662,3296009662,3296009662,3296009662,3296009662,3296009662,3296010302,3296010302,3296010302,3296010302,3296010302,3296010302,3296010302,3296010302,3296010302,3296010942,3296010942,3296010942,3296010942,3296010942,3296010942,3296010942,3296010942,3296010942,3396009112]
[null,108,3296006482,3296006482,3296006482,3296006482,3296006482,3296006482,3296006482,3296006482,3296007112,3296007112,3296007112,3296007112,3296007112,3296007112,3296007112,3296007112,3296007112,3296007752,3296007752,3296007752,3296007752,3296007752,3296007752,3296007752,3296007752,3296007752,3296008382,3296008382,3296008382,3296008382,3296008382,3296008382,3296008382,3296008382,3296008382,3296009022,3296009022,3296009022,3296009022,3296009022,3296009022,3296009022,3296009022,3296009022,3296009662,3296009662,3296009662,3296009662,3296009662,3296009662,3296009662,3296009662,3296009662,3296009662,3296010302,3296010302,3296010302,3296010302,3296010302,3296010302,3296010302,3296010302,3296010302,3296010942,3296010942,3296010942,3296010942,3296010942,3296010942,3296010942]
[null,110,3296006482,3296006482,3296006482,3296006482,3296006482,3296006482,3296006482,3296006482,3296006482,3296007112,3296007112,3296007112,3296007112,3296007112,3296007112,3296007112,3296007112,3296007112,3296007112,3296007752,3296007752,3296007752,3296007752,3296007752,3296007752,3296007752,3296007752,3296007752,3296008382,3296008382,3296008382,3296008382,3296008382,3296008382,3296008382,3296008382,3296008382,3296009022,3296009022,3296009022,3296009022,3296009022,3296009022,3296009022,3296009022,3296009022,3296009022,3296009662,3296009662,3296009662,3296009662,3296009662,3296009662,3296009662,3296009662,3296009662,3296010302,3296010302,3296010302,3296010302,3296010302,3296010302,3296010302,3296010302,3296010302,3296010942,3296010942,3296010942,3296010942,3296010942]
[null,112,3296006482,3296006482,3296006482,3296006482,3296006482,3296006482,3296006482,3296006482,3296006482,3296006482,3296006482,3296007112,3296007112,3296007112,3296007112,3296007112,3296007112,3296007112,3296007112,3296007112,3296007752,3296007752,3296007752,3296007752,3296007752,3296007752,3296007752,3296007752,3296007752,3296007752,3296008382,3296008382,3296008382,3296008382,3296008382,3296008382,3296008382,3296008382,3296008382,3296009022,3296009022,3296009022,3296009022,3296009022,3296009022,3296009022,3296009022,3296009022,3296009022,3296009662,3296009662,3296009662,3296009662,3296009662,3296009662,3296009662,3296009662,3296009662,3296009662,3296010302,3296010302,3296010302,3296010302,3296010302,3296010302,3296010302,3296010302,3296010302,3296010942,3296010942]
[null,114,3296508382,3296006482,3296006482,3296006482,3296006482,3296006482,3296006482,3296006482,3296006482,3296006482,3296006482,3296007112,3296007112,3296007112,3296007112,3296007112,3296007112,3296007112,3296007112,3296007112,3296007112,3296007752,3296007752,3296007752,3296007752,3296007752,3296007752,3296007752,3296007752,3296007752,3296008382,3296008382,3296008382,3296008382,3296008382,3296008382,3296008382,3296008382,3296008382,3296008382,3296009022,3296009022,3296009022,3296009022,3296009022,3296009022,3296009022,3296009022,3296009022,3296009022,3296009662,3296009662,3296009662,3296009662,3296009662,3296009662,3296009662,3296009662,3296009662,3396511372,3296010302,3296010302,3296010302,3296010302,3296010302,3296010302,3296010302,3296010302,3296010302,3296010302]
[null,116,3296508382,3296508382,3296006482,3296006482,3296006482,3296006482,3296006482,3296006482,3296006482,3296006482,3296006482,3296509892,3296007112,3296007112,3296007112,3296007112,3296007112,3296007112,3296007112,3296007112,3296007112,3296510642,3296007752,3296007752,3296007752,3296007752,3296007752,3296007752,3296007752,3296007752,3296511402,3296511402,3296008382,3296008382,3296008382,3296008382,3296008382,3296008382,3296008382,3296008382,3296512162,3296512162,3296009022,3296009022,3296009022,3296009022,3296009022,3296009022,3296009022,3396510182,3396510182,3396510772,3296009662,3296009662,3296009662,3296009662,3296009662,3296009662,3296009662,3396511372,3396511372,3396511372,3296010302,3296010302,3296010302,3296010302,3296010302,3296010302,3296010302,3296010302]
[null,118,3296508382,3296508382,3296508382,3296508382,3296006482,3296006482,3296006482,3296006482,3296006482,3296006482,3296006482,3296509132,3296509132,3296509892,3296007112,3296007112,3296007112,3296007112,3296007112,3296007112,3296509892,3296510642,3296510642,3296510642,3296007752,3296007752,3296007752,3296007752,3296007752,3296007752,3296511402,3296511402,3296511402,3296511402,3296511402,3296008382,3296008382,3296008382,3296008382,3296008382,3296512162,3296512162,3296512162,3296512162,3296512162,3296009022,3296009022,3296009022,3296009022,3396510182,3396510182,3396510182,3396510182,3396510182,3396510772,3296009662,3296009662,3296009662,3296009662,3396510772,3396510772,3396510772,3396511372,3396511372,3396511372,3296010302,3296010302,3296010302,3396511372,3396511372]
[null,120,3296508382,3296508382,3296508382,3296508382,3296508382,3296006482,3296006482,3296006482,3296006482,3296006482,3296509132,3296509132,3296509132,3296509132,3296509132,3296509892,3296007112,3296007112,3296007112,3296007112,3296509892,3296509892,3296509892,3296510642,3296510642,3296510642,3296007752,3296007752,3296007752,3296007752,3296510642,3296511402,3296511402,3296511402,3296511402,3296511402,3296511402,3296008382,3296008382,3296512162,3296512162,3296512162,3296512162,3296512162,3296512162,3296512162,3296512162,3296009022,3296009022,3396510182,3396510182,3396510182,3396510182,3396510182,3396510182,3396510182,3396510772,3296009662,3296009662,3396510772,3396510772,3396510772,3396510772,3396510772,3396511372,3396511372,3396511372,3396511372,3396511372,3396511372]
[null,122,3296508382,3296508382,3296508382,3296508382,3296508382,3296508382,3296508382,3296006482,3296006482,3296006482,3296509132,3296509132,3296509132,3296509132,3296509132,3296509132,3296509892,3296509892,3296007112,3296007112,3296509892,3296509892,3296509892,3296509892,3296509892,3296510642,3296510642,3296510642,3296007752,3296007752,3296510642,3296510642,3296510642,3296511402,3296511402,3296511402,3296511402,3296511402,3296511402,3296511402,3296511402,3296512162,3296512162,3296512162,3296512162,3296512162,3296512162,3296512162,3296512162,3296512162,3396510182,3396510182,3396510182,3396510182,3396510182,3396510182,3396510182,3396510182,3396510772,3396510772,3396510772,3396510772,3396510772,3396510772,3396510772,3396510772,3396511372,3396511372,3396511372,3396511372]
[null,124,3296507632,3296508382,3296508382,3296508382,3296508382,3296508382,3296508382,3296508382,3296508382,3296006482,3296509132,3296509132,3296509132,3296509132,3296509132,3296509132,3296509132,3296509132,3296509892,3296509892,3296509892,3296509892,3296509892,3296509892,3296509892,3296509892,3296510642,3296510642,3296510642,3296510642,3296510642,3296510642,3296510642,3296510642,3296510642,3296511402,3296511402,3296511402,3296511402,3296511402,3296511402,3296511402,3296511402,3296512162,3296512162,3296512162,3296512162,3296512162,3296512162,3296512162,3296512162,3296512162,3396510182,3396510182,3396510182,3396510182,3396510182,3396510182,3396510182,3396510182,3396510772,3396510772,3396510772,3396510772,3396510772,3396510772,3396510772,3396510772,3396510772,3396511372]
[null,126,3296507632,3296507632,3296508382,3296508382,3296508382,3296508382,3296508382,3296508382,3296508382,3296508382,3296508382,3296509132,3296509132,3296509132,3296509132,3296509132,3296509132,3296509132,3296509132,3296509892,3296509892,3296509892,3296509892,3296509892,3296509892,3296509892,3296509892,3296509892,3296510642,3296510642,3296510642,3296510642,3296510642,3296510642,3296510642,3296510642,3296511402,3296511402,3296511402,3296511402,3296511402,3296511402,3296511402,3296511402,3296511402,3296512162,3296512162,3296512162,3296512162,3296512162,3296512162,3296512162,3296512162,3296512162,3396510182,3396510182,3396510182,3396510182,3396510182,3396510182,3396510182,3396510182,3396510772,3396510772,3396510772,3396510772,3396510772,3396510772,3396510772,3396510772]
[null,128,3296507632,3296507632,3296507632,3296508382,3296508382,3296508382,3296508382,3296508382,3296508382,3296508382,3296508382,3296508382,3296509132,3296509132,3296509132,3296509132,3296509132,3296509132,3296509132,3296509132,3296509132,3296509892,3296509892,3296509892,3296509892,3296509892,3296509892,3296509892,3296509892,3296509892,3296510642,3296510642,3296510642,3296510642,3296510642,3296510642,3296510642,3296510642,3296511402,3296511402,3296511402,3296511402,3296511402,3296511402,3296511402,3296511402,3296511402,3296512162,3296512162,3296512162,3296512162,3296512162,3296512162,3296512162,3296512162,3296512162,3396510182,3396510182,3396510182,3396510182,3396510182,3396510182,3396510182,3396510182,3396510182,3396510772,3396510772,3396510772,3396510772,3396510772]
[null,130,3296507632,3296507632,3296507632,3296507632,3296507632,3296508382,3296508382,3296508382,3296508382,3296508382,3296508382,3296508382,3296508382,3296509132,3296509132,3296509132,3296509132,3296509132,3296509132,3296509132,3296509132,3296509132,3296509892,3296509892,3296509892,3296509892,3296509892,3296509892,3296509892,3296509892,3296509892,3296510642,3296510642,3296510642,3296510642,3296510642,3296510642,3296510642,3296510642,3296510642,3296511402,3296511402,3296511402,3296511402,3296511402,3296511402,3296511402,3296511402,3296511402,3296512162,3296512162,3296512162,3296512162,3296512162,3296512162,3296512162,3296512162,3296512162,3396510182,3396510182,3396510182,3396510182,3396510182,3396510182,3396510182,3396510182,3396510182,3396510772,3396510772,3396510772]
[null,132,3296507632,3296507632,3296507632,3296507632,3296507632,3296507632,3296508382,3296508382,3296508382,3296508382,3296508382,3296508382,3296508382,3296508382,3296508382,3296509132,3296509132,3296509132,3296509132,3296509132,3296509132,3296509132,3296509132,3296509132,3296509892,3296509892,3296509892,3296509892,3296509892,3296509892,3296509892,3296509892,3296509892,3296510642,3296510642,3296510642,3296510642,3296510642,3296510642,3296510642,3296510642,3296510642,3296511402,3296511402,3296511402,3296511402,3296511402,3296511402,3296511402,3296511402,3296511402,3296512162,3296512162,3296512162,3296512162,3296512162,3296512162,3296512162,3296512162,3296512162,3396510182,3396510182,3396510182,3396510182,3396510182,3396510182,3396510182,3396510182,3396510182,3396510772]
[null,134,3296507632,3296507632,3296507632,3296507632,3296507632,3296507632,3296507632,3296508382,3296508382,3296508382,3296508382,3296508382,3296508382,3296508382,3296508382,3296508382,3296509132,3296509132,3296509132,3296509132,3296509132,3296509132,3296509132,3296509132,3296509132,3296509892,3296509892,3296509892,3296509892,3296509892,3296509892,3296509892,3296509892,3296509892,3296509892,3296510642,3296510642,3296510642,3296510642,3296510642,3296510642,3296510642,3296510642,3296510642,3296511402,3296511402,3296511402,3296511402,3296511402,3296511402,3296511402,3296511402,3296511402,3296512162,3296512162,3296512162,3296512162,3296512162,3296512162,3296512162,3296512162,3296512162,3396510182,3396510182,3396510182,3396510182,3396510182,3396510182,3396510182,3396510182]
[null,136,3296507632,3296507632,3296507632,3296507632,3296507632,3296507632,3296507632,3296507632,3296508382,3296508382,3296508382,3296508382,3296508382,3296508382,3296508382,3296508382,3296508382,3296508382,3296509132,3296509132,3296509132,3296509132,3296509132,3296509132,3296509132,3296509132,3296509132,3296509892,3296509892,3296509892,3296509892,3296509892,3296509892,3296509892,3296509892,3296509892,3296510642,3296510642,3296510642,3296510642,3296510642,3296510642,3296510642,3296510642,3296510642,3296510642,3296511402,3296511402,3296511402,3296511402,3296511402,3296511402,3296511402,3296511402,3296511402,3296512162,3296512162,3296512162,3296512162,3296512162,3296512162,3296512162,3296512162,3296512162,3396510182,3396510182,3396510182,3396510182,3396510182,3396510182]
[null,138,3296507632,3296507632,3296507632,3296507632,3296507632,3296507632,3296507632,3296507632,3296507632,3296507632,3296508382,3296508382,3296508382,3296508382,3296508382,3296508382,3296508382,3296508382,3296508382,3296509132,3296509132,3296509132,3296509132,3296509132,3296509132,3296509132,3296509132,3296509132,3296509132,3296509892,3296509892,3296509892,3296509892,3296509892,3296509892,3296509892,3296509892,3296509892,3296510642,3296510642,3296510642,3296510642,3296510642,3296510642,3296510642,3296510642,3296510642,3296511402,3296511402,3296511402,3296511402,3296511402,3296511402,3296511402,3296511402,3296511402,3296511402,3296512162,3296512162,3296512162,3296512162,3296512162,3296512162,3296512162,3296512162,3296512162,3396510182,3396510182,3396510182,3396510182]
[null,140,3296507632,3296507632,3296507632,3296507632,3296507632,3296507632,3296507632,3296507632,3296507632,3296507632,3296507632,3296508382,3296508382,3296508382,3296508382,3296508382,3296508382,3296508382,3296508382,3296508382,3296508382,3296509132,3296509132,3296509132,3296509132,3296509132,3296509132,3296509132,3296509132,3296509132,3296509892,3296509892,3296509892,3296509892,3296509892,3296509892,3296509892,3296509892,3296509892,3296509892,3296510642,3296510642,3296510642,3296510642,3296510642,3296510642,3296510642,3296510642,3296510642,3296511402,3296511402,3296511402,3296511402,3296511402,3296511402,3296511402,3296511402,3296511402,3296511402,3296512162,3296512162,3296512162,3296512162,3296512162,3296512162,3296512162,3296512162,3296512162,3396510182,3396510182]
[null,142,3296507632,3296507632,3296507632,3296507632,3296507632,3296507632,3296507632,3296507632,3296507632,3296507632,3296507632,3296507632,3296508382,3296508382,3296508382,3296508382,3296508382,3296508382,3296508382,3296508382,3296508382,3296508382,3296509132,3296509132,3296509132,3296509132,3296509132,3296509132,3296509132,3296509132,3296509132,3296509892,3296509892,3296509892,3296509892,3296509892,3296509892,3296509892,3296509892,3296509892,3296509892,3296510642,3296510642,3296510642,3296510642,3296510642,3296510642,3296510642,3296510642,3296510642,3296510642,3296511402,3296511402,3296511402,3296511402,3296511402,3296511402,3296511402,3296511402,3296511402,3296512162,3296512162,3296512162,3296512162,3296512162,3296512162,3296512162,3296512162,3296512162,3296512162]
[null,144,3397008372,3397008372,3296507632,3296507632,3296507632,3296507632,3296507632,3296507632,3296507632,3296507632,3296507632,3296507632,3296508382,3296508382,3296508382,3296508382,3296508382,3296508382,3296508382,3296508382,3296508382,3397009752,3296509132,3296509132,3296509132,3296509132,3296509132,3296509132,3296509132,3296509132,3296509132,3397010442,3296509892,3296509892,3296509892,3296509892,3296509892,3296509892,3296509892,3296509892,3296509892,3397011132,3296510642,3296510642,3296510642,3296510642,3296510642,3296510642,3296510642,3296510642,3397011832,3397011832,3296511402,3296511402,3296511402,3296511402,3296511402,3296511402,3296511402,3296511402,3296511402,3296511402,3296512162,3296512162,3296512162,3296512162,3296512162,3296512162,3296512162,3296512162]
[null,146,3295305032,3295305032,3397008372,3296507632,3296507632,3296507632,3296507632,3296507632,3296507632,3296507632,3296507632,3296507632,3397008372,3296508382,3296508382,3296508382,3296508382,3296508382,3296508382,3296508382,3296508382,3397009752,3397009752,3296509132,3296509132,3296509132,3296509132,3296509132,3296509132,3296509132,3296509132,3397010442,3397010442,3397010442,3296509892,3296509892,3296509892,3296509892,3296509892,3296509892,3296509892,3397011132,3397011132,3397011132,3296510642,3296510642,3296510642,3296510642,3296510642,3296510642,3397011832,3397011832,3397011832,3397011832,3296511402,3296511402,3296511402,3296511402,3296511402,3296511402,3397012522,3397012522,3296511402,3296511402,3296512162,3296512162,3296512162,3296512162,3296512162,3296512162]
[null,148,3295305032,3295305032,3295305032,3397008372,3296507632,3296507632,3296507632,3296507632,3296507632,3296507632,3296507632,3397008372,3397008372,3397008372,3397008372,3296508382,3296508382,3296508382,3296508382,3296508382,3296508382,3397009062,3397009062,3397009752,3397009752,3296509132,3296509132,3296509132,3296509132,3296509132,3296509132,3397010442,3397010442,3397010442,3397010442,3296509892,3296509892,3296509892,3296509892,3296509892,3397011132,3397011132,3397011132,3397011132,3397011132,3296510642,3296510642,3296510642,3296510642,3296510642,3397011832,3397011832,3397011832,3397011832,3397011832,3397011832,3296511402,3296511402,3296511402,3296511402,3397012522,3397012522,3397012522,3397012522,3296511402,3296511402,3296512162,3296512162,3296512162,3296512162]
[null,150,3295305032,3295305032,3295305032,3295305032,3397008372,3397008372,3296507632,3296507632,3296507632,3296507632,3296507632,3397008372,3397008372,3397008372,3397008372,3397008372,3296508382,3296508382,3296508382,3296508382,3296508382,3397009062,3397009062,3397009062,3397009752,3397009752,3397009752,3296509132,3296509132,3296509132,3397009752,3397009752,3397009752,3397010442,3397010442,3397010442,3397010442,3296509892,3296509892,3296509892,3397010442,3397011132,3397011132,3397011132,3397011132,3397011132,3397011132,3296510642,3296510642,3296510642,3397011832,3397011832,3397011832,3397011832,3397011832,3397011832,3397011832,3397011832,3296511402,3296511402,3397012522,3397012522,3397012522,3397012522,3397012522,3397012522,3296511402,3296511402,3296512162,3296512162]
[null,152,3295305032,3295305032,3295305032,3295305032,3295305032,3397008372,3397008372,3296507632,3296507632,3296507632,3296507632,3397008372,3397008372,3397008372,3397008372,3397008372,3397008372,3397009062,3296508382,3296508382,3296508382,3397009062,3397009062,3397009062,3397009062,3397009062,3397009752,3397009752,3296509132,3296509132,3397009752,3397009752,3397009752,3397009752,3397010442,3397010442,3397010442,3397010442,3397010442,3296509892,3397010442,3397010442,3397011132,3397011132,3397011132,3397011132,3397011132,3397011132,3397011132,3296510642,3397011132,3397011832,3397011832,3397011832,3397011832,3397011832,3397011832,3397011832,3397011832,3397012522,3397012522,3397012522,3397012522,3397012522,3397012522,3397012522,3397012522,3397012522,3296511402,3296511402]
[null,154,3295305032,3295305032,3295305032,3295305032,3295305032,3295305032,3295305032,3397008372,3296507632,3296507632,3296507632,3397008372,3397008372,3397008372,3397008372,3397008372,3397008372,3397008372,3397009062,3296508382,3397009062,3397009062,3397009062,3397009062,3397009062,3397009062,3397009062,3397009752,3397009752,3397009752,3397009752,3397009752,3397009752,3397009752,3397009752,3397010442,3397010442,3397010442,3397010442,3397010442,3397010442,3397010442,3397010442,3397010442,3397011132,3397011132,3397011132,3397011132,3397011132,3397011132,3397011132,3397011132,3397011132,3397011832,3397011832,3397011832,3397011832,3397011832,3397011832,3397011832,3397011832,3397012522,3397012522,3397012522,3397012522,3397012522,3397012522,3397012522,3397012522,3397012522]
[null,156,3295305032,3295305032,3295305032,3295305032,3295305032,3295305032,3295305032,3295305032,3397008372,3397008372,3397008372,3397008372,3397008372,3397008372,3397008372,3397008372,3397008372,3397008372,3397008372,3397008372,3397009062,3397009062,3397009062,3397009062,3397009062,3397009062,3397009062,3397009062,3397009752,3397009752,3397009752,3397009752,3397009752,3397009752,3397009752,3397009752,3397009752,3397010442,3397010442,3397010442,3397010442,3397010442,3397010442,3397010442,3397010442,3397010442,3397011132,3397011132,3397011132,3397011132,3397011132,3397011132,3397011132,3397011132,3397011832,3397011832,3397011832,3397011832,3397011832,3397011832,3397011832,3397011832,3397011832,3397012522,3397012522,3397012522,3397012522,3397012522,3397012522,3397012522]
[null,158,3295305032,3295305032,3295305032,3295305032,3295305032,3295305032,3295305032,3295305032,3295305032,3397008372,3397008372,3397008372,3397008372,3397008372,3397008372,3397008372,3397008372,3397008372,3397008372,3397008372,3397008372,3397009062,3397009062,3397009062,3397009062,3397009062,3397009062,3397009062,3397009062,3397009062,3397009752,3397009752,3397009752,3397009752,3397009752,3397009752,3397009752,3397009752,3397010442,3397010442,3397010442,3397010442,3397010442,3397010442,3397010442,3397010442,3397010442,3397011132,3397011132,3397011132,3397011132,3397011132,3397011132,3397011132,3397011132,3397011132,3397011832,3397011832,3397011832,3397011832,3397011832,3397011832,3397011832,3397011832,3397011832,3397012522,3397012522,3397012522,3397012522,3397012522]
[null,160,3295305032,3295305032,3295305032,3295305032,3295305032,3295305032,3295305032,3295305032,3295305032,3295305032,3295305512,3397008372,3397008372,3397008372,3397008372,3397008372,3397008372,3397008372,3397008372,3397008372,3397008372,3397008372,3397009062,3397009062,3397009062,3397009062,3397009062,3397009062,3397009062,3397009062,3397009062,3397009752,3397009752,3397009752,3397009752,3397009752,3397009752,3397009752,3397009752,3397009752,3397010442,3397010442,3397010442,3397010442,3397010442,3397010442,3397010442,3397010442,3397010442,3397011132,3397011132,3397011132,3397011132,3397011132,3397011132,3397011132,3397011132,3397011132,3397011832,3397011832,3397011832,3397011832,3397011832,3397011832,3397011832,3397011832,3397011832,3397012522,3397012522,3397012522]
[null,162,3295505412,3295305032,3295305032,3295305032,3295305032,3295305032,3295305032,3295305032,3295305032,3295305032,3295305512,3295305512,3397008372,3397008372,3397008372,3397008372,3397008372,3397008372,3397008372,3397008372,3397008372,3397008372,3397008372,3397009062,3397009062,3397009062,3397009062,3397009062,3397009062,3397009062,3397009062,3397009062,3397009752,3397009752,3397009752,3397009752,3397009752,3397009752,3397009752,3397009752,3397009752,3397010442,3397010442,3397010442,3397010442,3397010442,3397010442,3397010442,3397010442,3397010442,3397011132,3397011132,3397011132,3397011132,3397011132,3397011132,3397011132,3397011132,3397011132,3397011832,3397011832,3397011832,3397011832,3397011832,3397011832,3397011832,3397011832,3397011832,3397012522,3397012522]
[null,164,3295505412,3295505412,3295305032,3295305032,3295305032,3295305032,3295305032,3295305032,3295305032,3295305032,3295505932,3295505932,3295305512,3397008372,3397008372,3397008372,3397008372,3397008372,3397008372,3397008372,3397008372,3397008372,3397008372,3397008372,3397008372,3397009062,3397009062,3397009062,3397009062,3397009062,3397009062,3397009062,3397009062,3397009062,3397009752,3397009752,3397009752,3397009752,3397009752,3397009752,3397009752,3397009752,3397009752,3397010442,3397010442,3397010442,3397010442,3397010442,3397010442,3397010442,3397010442,3397010442,3397011132,3397011132,3397011132,3397011132,3397011132,3397011132,3397011132,3397011132,3397011132,3397011832,3397011832,3397011832,3397011832,3397011832,3397011832,3397011832,3397011832,3397011832]
[null,166,3295505412,3295505412,3295505412,3295305032,3295305032,3295305032,3295305032,3295305032,3295305032,3295305032,3295505932,3295505932,3295505932,3295305512,3397008372,3397008372,3397008372,3397008372,3397008372,3397008372,3397008372,3397008372,3397008372,3397008372,3397008372,3397008372,3397009062,3397009062,3397009062,3397009062,3397009062,3397009062,3397009062,3397009062,3397009062,3397009752,3397009752,3397009752,3397009752,3397009752,3397009752,3397009752,3397009752,3397009752,3397010442,3397010442,3397010442,3397010442,3397010442,3397010442,3397010442,3397010442,3397010442,3397010442,3397011132,3397011132,3397011132,3397011132,3397011132,3397011132,3397011132,3397011132,3397011132,3397011832,3397011832,3397011832,3397011832,3397011832,3397011832,3397011832]
[null,168,3295505412,3295505412,3295505412,3295505412,3295305032,3295305032,3295305032,3295305032,3295305032,3295505932,3295505932,3295505932,3295505932,3295505932,3295305512,3295305512,3397008372,3397008372,3397008372,3397008372,3397008372,3397008372,3397008372,3397008372,3397008372,3397008372,3397008372,3397009062,3397009062,3397009062,3397009062,3397009062,3397009062,3397009062,3397009062,3397009062,3397009062,3397009752,3397009752,3397009752,3397009752,3397009752,3397009752,3397009752,3397009752,3397009752,3397010442,3397010442,3397010442,3397010442,3397010442,3397010442,3397010442,3397010442,3397010442,3397011132,3397011132,3397011132,3397011132,3397011132,3397011132,3397011132,3397011132,3397011132,3397011832,3397011832,3397011832,3397011832,3397011832,3397011832]
[null,170,3295505412,3295505412,3295505412,3295505412,3295505412,3295305032,3295305032,3295305032,3295305032,3295505932,3295505932,3295505932,3295505932,3295505932,3295505932,3295505932,3295305512,3397008372,3397008372,3397008372,3397008372,3397008372,3397008372,3397008372,3397008372,3397008372,3397008372,3397008372,3397009062,3397009062,3397009062,3397009062,3397009062,3397009062,3397009062,3397009062,3397009062,3397009062,3397009752,3397009752,3397009752,3397009752,3397009752,3397009752,3397009752,3397009752,3397009752,3397010442,3397010442,3397010442,3397010442,3397010442,3397010442,3397010442,3397010442,3397010442,3397010442,3397011132,3397011132,3397011132,3397011132,3397011132,3397011132,3397011132,3397011132,3397011132,3397011832,3397011832,3397011832,3397011832]
[null,{"$f":"B68+2","v":172},3295505412,3295505412,3295505412,3295505412,3295505412,3295505412,3295305032,3295305032,3295305032,3295505932,3295505932,3295505932,3295505932,3295505932,3295505932,3295505932,3295505932,3295305512,3397008372,3397008372,3397008372,3397008372,3397008372,3397008372,3397008372,3397008372,3397008372,3397008372,3397008372,3397008372,3397009062,3397009062,3397009062,3397009062,3397009062,3397009062,3397009062,3397009062,3397009062,3397009752,3397009752,3397009752,3397009752,3397009752,3397009752,3397009752,3397009752,3397009752,3397009752,3397010442,3397010442,3397010442,3397010442,3397010442,3397010442,3397010442,3397010442,3397010442,3397011132,3397011132,3397011132,3397011132,3397011132,3397011132,3397011132,3397011132,3397011132,3397011132,3397011832,3397011832]
[null,174,3295505412,3295505412,3295505412,3295505412,3295505412,3295505412,3295505412,3295505412,3295305032,3295505932,3295505932,3295505932,3295505932,3295505932,3295505932,3295505932,3295505932,3295505932,3295505932,3295506462,3397008372,3397008372,3397008372,3397008372,3397008372,3397008372,3397008372,3397008372,3397008372,3397008372,3397008372,3397009062,3397009062,3397009062,3397009062,3397009062,3397009062,3397009062,3397009062,3397009062,3397009062,3397009752,3397009752,3397009752,3397009752,3397009752,3397009752,3397009752,3397009752,3397009752,3397010442,3397010442,3397010442,3397010442,3397010442,3397010442,3397010442,3397010442,3397010442,3397010442,3397011132,3397011132,3397011132,3397011132,3397011132,3397011132,3397011132,3397011132,3397011132,3397011832]
[null,176,3295505412,3295505412,3295505412,3295505412,3295505412,3295505412,3295505412,3295505412,3295505412,3295505412,3295505932,3295505932,3295505932,3295505932,3295505932,3295505932,3295505932,3295505932,3295505932,3295505932,3295506462,3397008372,3397008372,3397008372,3397008372,3397008372,3397008372,3397008372,3397008372,3397008372,3397008372,3397008372,3397009062,3397009062,3397009062,3397009062,3397009062,3397009062,3397009062,3397009062,3397009062,3397009752,3397009752,3397009752,3397009752,3397009752,3397009752,3397009752,3397009752,3397009752,3397009752,3397010442,3397010442,3397010442,3397010442,3397010442,3397010442,3397010442,3397010442,3397010442,3397010442,3397011132,3397011132,3397011132,3397011132,3397011132,3397011132,3397011132,3397011132,3397011132]
[null,178,3295505412,3295505412,3295505412,3295505412,3295505412,3295505412,3295505412,3295505412,3295505412,3295505412,3295505412,3295505932,3295505932,3295505932,3295505932,3295505932,3295505932,3295505932,3295505932,3295505932,3295506462,3295506462,3397008372,3397008372,3397008372,3397008372,3397008372,3397008372,3397008372,3397008372,3397008372,3397008372,3397009062,3397009062,3397009062,3397009062,3397009062,3397009062,3397009062,3397009062,3397009062,3295507512,3397009752,3397009752,3397009752,3397009752,3397009752,3397009752,3397009752,3397009752,3397009752,3295508042,3397010442,3397010442,3397010442,3397010442,3397010442,3397010442,3397010442,3397010442,3397010442,3295508572,3397011132,3397011132,3397011132,3397011132,3397011132,3397011132,3397011132,3397011132]
[null,180,3296007112,3295505412,3295505412,3295505412,3295505412,3295505412,3295505412,3295505412,3295505412,3295505412,3296008382,3295505932,3295505932,3295505932,3295505932,3295505932,3295505932,3295505932,3295505932,3295505932,3296009022,3295506462,3295506462,3397008372,3397008372,3397008372,3397008372,3397008372,3397008372,3397008372,3397008372,3295506982,3295506982,3295506982,3397009062,3397009062,3397009062,3397009062,3397009062,3397009062,3397009062,3295507512,3295507512,3295507512,3397009752,3397009752,3397009752,3397009752,3397009752,3397009752,3397009752,3295508042,3295508042,3295508042,3397010442,3397010442,3397010442,3397010442,3397010442,3397010442,3397010442,3295508572,3295508572,3295508572,3397011132,3397011132,3397011132,3397011132,3397011132,3397011132]
[null,182,3296007112,3296007112,3295505412,3295505412,3295505412,3295505412,3295505412,3295505412,3295505412,3295505412,3296008382,3296008382,3295505932,3295505932,3295505932,3295505932,3295505932,3295505932,3295505932,3295505932,3296009022,3296009022,3295506462,3295506462,3295506462,3397008372,3397008372,3397008372,3397008372,3397008372,3397008372,3296009662,3295506982,3295506982,3295506982,3397009062,3397009062,3397009062,3397009062,3397009062,3397009062,3296010942,3295507512,3295507512,3295507512,3397009752,3397009752,3397009752,3397009752,3397009752,3397009752,3396009112,3295508042,3295508042,3295508042,3397010442,3397010442,3397010442,3397010442,3397010442,3396009612,3396009612,3295508572,3295508572,3295508572,3397011132,3397011132,3397011132,3397011132,3397011132]
[null,184,3296007112,3296007112,3296007112,3295505412,3295505412,3295505412,3295505412,3295505412,3295505412,3295505412,3296007752,3296008382,3296008382,3295505932,3295505932,3295505932,3295505932,3295505932,3295505932,3295505932,3296009022,3296009022,3296009022,3295506462,3295506462,3295506462,3397008372,3397008372,3397008372,3397008372,3397008372,3296009662,3296009662,3295506982,3295506982,3295506982,3397009062,3397009062,3397009062,3397009062,3397009062,3296010302,3296010942,3295507512,3295507512,3295507512,3295507512,3397009752,3397009752,3397009752,3397009752,3396009112,3396009112,3295508042,3295508042,3295508042,3295508042,3397010442,3397010442,3397010442,3396009612,3396009612,3396009612,3295508572,3295508572,3295508572,3295508572,3397011132,3397011132,3397011132]
[null,186,3296007112,3296007112,3296007112,3296007752,3295505412,3295505412,3295505412,3295505412,3295505412,3295505412,3296007752,3296008382,3296008382,3296008382,3295505932,3295505932,3295505932,3295505932,3295505932,3296009022,3296009022,3296009022,3296009022,3296009022,3295506462,3295506462,3295506462,3397008372,3397008372,3397008372,3397008372,3296009662,3296009662,3296009662,3295506982,3295506982,3295506982,3295506982,3397009062,3397009062,3397009062,3296010302,3296010302,3296010942,3296010942,3295507512,3295507512,3295507512,3397009752,3397009752,3296010942,3396009112,3396009112,3396009112,3396009112,3295508042,3295508042,3295508042,3396009112,3397010442,3396009612,3396009612,3396009612,3396009612,3396009612,3295508572,3295508572,3295508572,3295508572,3397011132]
[null,188,3296007112,3296007112,3296007112,3296007112,3296007752,3295505412,3295505412,3295505412,3295505412,3295505412,3296007752,3296007752,3296008382,3296008382,3296008382,3295505932,3295505932,3295505932,3295505932,3296008382,3296009022,3296009022,3296009022,3296009022,3296009022,3296009022,3295506462,3295506462,3295506462,3397008372,3397008372,3296009662,3296009662,3296009662,3296009662,3296009662,3295506982,3295506982,3296010302,3397009062,3397009062,3296010302,3296010302,3296010302,3296010302,3296010942,3295507512,3295507512,3296010942,3296010942,3296010942,3296010942,3296010942,3396009112,3396009112,3396009112,3295508042,3295508042,3396009112,3396009112,3396009112,3396009612,3396009612,3396009612,3396009612,3396009612,3396009612,3396009612,3396009612,3295508572]
[null,190,3296007112,3296007112,3296007112,3296007112,3296007112,3296007752,3295505412,3295505412,3295505412,3295505412,3296007752,3296007752,3296007752,3296008382,3296008382,3296008382,3295505932,3295505932,3295505932,3296008382,3296008382,3296009022,3296009022,3296009022,3296009022,3296009022,3296009022,3295506462,3295506462,3296009022,3397008372,3296009662,3296009662,3296009662,3296009662,3296009662,3296009662,3295506982,3296010302,3296010302,3296010302,3296010302,3296010302,3296010302,3296010302,3296010302,3296010942,3295507512,3296010942,3296010942,3296010942,3296010942,3296010942,3296010942,3396009112,3396009112,3396009112,3396009112,3396009112,3396009112,3396009112,3396009112,3396009612,3396009612,3396009612,3396009612,3396009612,3396009612,3396009612,3396009612]
[null,192,3296007112,3296007112,3296007112,3296007112,3296007112,3296007112,3296007752,3295505412,3295505412,3296007752,3296007752,3296007752,3296007752,3296007752,3296008382,3296008382,3296008382,3295505932,3295505932,3296008382,3296008382,3296008382,3296008382,3296009022,3296009022,3296009022,3296009022,3296009022,3295506462,3296009022,3296009022,3296009662,3296009662,3296009662,3296009662,3296009662,3296009662,3296009662,3296009662,3296010302,3296010302,3296010302,3296010302,3296010302,3296010302,3296010302,3296010302,3296010942,3296010942,3296010942,3296010942,3296010942,3296010942,3296010942,3296010942,3396009112,3396009112,3396009112,3396009112,3396009112,3396009112,3396009112,3396009112,3396009112,3396009612,3396009612,3396009612,3396009612,3396009612,3396009612]
[null,194,3296007112,3296007112,3296007112,3296007112,3296007112,3296007112,3296007112,3296007752,3295505412,3296007752,3296007752,3296007752,3296007752,3296007752,3296007752,3296008382,3296008382,3296008382,3296008382,3296008382,3296008382,3296008382,3296008382,3296008382,3296009022,3296009022,3296009022,3296009022,3296009022,3296009022,3296009022,3296009022,3296009662,3296009662,3296009662,3296009662,3296009662,3296009662,3296009662,3296009662,3296010302,3296010302,3296010302,3296010302,3296010302,3296010302,3296010302,3296010302,3296010302,3296010942,3296010942,3296010942,3296010942,3296010942,3296010942,3296010942,3296010942,3396009112,3396009112,3396009112,3396009112,3396009112,3396009112,3396009112,3396009112,3396009612,3396009612,3396009612,3396009612,3396009612]
[null,{"$f":"B80+2","v":196},3296007112,3296007112,3296007112,3296007112,3296007112,3296007112,3296007112,3296007112,3296007752,3296007752,3296007752,3296007752,3296007752,3296007752,3296007752,3296007752,3296008382,3296008382,3296008382,3296008382,3296008382,3296008382,3296008382,3296008382,3296008382,3296009022,3296009022,3296009022,3296009022,3296009022,3296009022,3296009022,3296009022,3296009662,3296009662,3296009662,3296009662,3296009662,3296009662,3296009662,3296009662,3296010302,3296010302,3296010302,3296010302,3296010302,3296010302,3296010302,3296010302,3296010302,3296010942,3296010942,3296010942,3296010942,3296010942,3296010942,3296010942,3296010942,3396009112,3396009112,3396009112,3396009112,3396009112,3396009112,3396009112,3396009112,3396009112,3396009612,3396009612,3396009612]
[null,{"$f":"B81+2","v":198},3296007112,3296007112,3296007112,3296007112,3296007112,3296007112,3296007112,3296007112,3296007112,3296007752,3296007752,3296007752,3296007752,3296007752,3296007752,3296007752,3296007752,3296008382,3296008382,3296008382,3296008382,3296008382,3296008382,3296008382,3296008382,3296008382,3296009022,3296009022,3296009022,3296009022,3296009022,3296009022,3296009022,3296009022,3296009662,3296009662,3296009662,3296009662,3296009662,3296009662,3296009662,3296009662,3296009662,3296010302,3296010302,3296010302,3296010302,3296010302,3296010302,3296010302,3296010302,3296010942,3296010942,3296010942,3296010942,3296010942,3296010942,3296010942,3296010942,3296010942,3396009112,3396009112,3396009112,3396009112,3396009112,3396009112,3396009112,3396009112,3396009612,3396009612]
[null,200,3296006482,3296007112,3296007112,3296007112,3296007112,3296007112,3296007112,3296007112,3296007112,3296007112,3296007752,3296007752,3296007752,3296007752,3296007752,3296007752,3296007752,3296007752,3296008382,3296008382,3296008382,3296008382,3296008382,3296008382,3296008382,3296008382,3296008382,3296009022,3296009022,3296009022,3296009022,3296009022,3296009022,3296009022,3296009022,3296009662,3296009662,3296009662,3296009662,3296009662,3296009662,3296009662,3296009662,3296009662,3296010302,3296010302,3296010302,3296010302,3296010302,3296010302,3296010302,3296010302,3296010942,3296010942,3296010942,3296010942,3296010942,3296010942,3296010942,3296010942,3396008612,3396009112,3396009112,3396009112,3396009112,3396009112,3396009112,3396009112,3396009112,3396009112]